{"text_format":"1","workbook":"xlsx","n_sheets":6,"sheets":["Start","Lista pracowników","Lista objaśnienia","Zestawienie stanowisk","Zestawienie objaśnienia","Siatka płac"],"not_rendered":{"charts":1,"images":0,"macros":1,"external_links":0,"defined_names":7,"comments":0,"pivot_tables":0},"unopened":[],"bounds":{"document_bytes":16777216,"sheet_cells":100000,"rows_first":2000,"rows_last":500,"rows_between":2000,"halvings":0,"cell_chars":16384,"cell_head_chars":4096},"cells_cut":0,"cells_raw":0,"read":"whole","date_system":"1900"}

{"sheet":"Start","index":0,"n_rows":24,"n_cols":10,"rows_kept":24,"cut":false,"hidden":false,"merged":[[7,2,7,11],[4,2,4,11],[13,2,13,4],[13,5,13,8],[1,1,1,11],[8,2,8,11],[5,2,5,11],[6,2,6,11],[18,2,18,11],[11,9,11,10],[11,5,11,7],[11,2,11,4],[15,2,15,11],[16,2,16,4],[16,6,16,7],[16,9,16,11]]}
[]
[null,"Siatka płac"]
[]
[]
[null,"J","Jak używać pliku:"]
[null,1,"Zasilić zakładkę danymi zakładkę „Lista pracowników”"]
[null,2,"Przypisać stanowiskom w „Zestawieniu stanowisk” numer kategorii zaszeregowania"]
[null,3,"Wpisać miminum kategorii zaszeregowania i ich rozpiętość w „Siatce płac”"]
[null,4,"Edytując watrości w zakładce \"Siatka Płac\" oraz numery kategorii zaszeregowania w zakładce \"Zestawienie stanowisk\" przeprowadzamy symulacje zmian w siatce płac w organizacji"]
[]
[]
[null,"Zakładki:","Lista pracowników",null,null,"Zestawienie stanowisk",null,null,null,"Siatka płac"]
[]
[null,null,"Objaśnienia do Listy pracowników",null,null,"Objaśnienia do zestawienia stanowisk"]
[]
[null,null,"Plik pozwala wprowadzić:"]
[null,null,"Do 12 kategorii zaszeregowania",null,null,null,"Do 600 pracowników",null,null,"Do 60 stanowisk"]
[]
[null,null,"Dla zoobrazowania działania pliku jest on zasilony przykładowymi danymi."]
[]
[]
[]
[]
["AUTOR: Paweł Szaradowski"]

{"sheet":"Lista pracowników","index":1,"n_rows":600,"n_cols":14,"rows_kept":600,"cut":false,"hidden":false,"merged":[[2,5,2,6],[0,1,0,3]]}
[null,"Lista pracowników",null,null,null,null,"Liczba pracowników:",{"$f":"SUM(A5:A600)","v":426}]
[null,"Zestawienie stanowisk","Siatka płac","Menu","Objaśnienia"]
[]
["po","Stanowisko","Wynagrodzenie zasadnicze brutto","Nazwisko i imię pracownika","Kategoria zaszeregowania","wartość compa ratio\n(miejsce w siatce płac)","Kwartyl w \nsiatce płac","koszt miesięczny \"podciągnięcia\" do minimum kategorii",null,null,null,null,{"$f":"MAX('Siatka płac'!B6:B17)","v":7}]
[{"$f":"IF(ISBLANK(B5),0,1)","v":1},"Monter",1500,"Pracownik 1",{"$f":"IFERROR((VLOOKUP(B5,'Zestawienie stanowisk'!$B$5:$E$65,4,FALSE)),\"-\")","v":1},{"$f":"IFERROR(((C5-(VLOOKUP(E5,'Siatka płac'!$B$6:$E$17,3,FALSE)))/(VLOOKUP(E5,'Siatka płac'!$B$6:$E$17,4,FALSE)-VLOOKUP(E5,'Siatka płac'!$B$6:$E$17,3,FALSE))),\"-\")","v":-0.25},{"$f":"IFERROR((INDEX($N$5:$N$10,MATCH(F5,$M$5:$M$10,-1))),\"-\")","v":"poniżej min."},{"$f":"IF(G5=\"poniżej min.\",((VLOOKUP(E5,'Siatka płac'!$B$6:$D$17,3,FALSE)-C5)*(13-'Zestawienie stanowisk'!$H$1)),\"-\")","v":500},null,null,null,null,10,"powyżej maks."]
[1,"Operator",2300,"Pracownik 2",{"$f":"IFERROR((VLOOKUP(B6,'Zestawienie stanowisk'!$B$5:$E$65,4,FALSE)),\"-\")","v":1},{"$f":"IFERROR(((C6-(VLOOKUP(E6,'Siatka płac'!$B$6:$E$17,3,FALSE)))/(VLOOKUP(E6,'Siatka płac'!$B$6:$E$17,4,FALSE)-VLOOKUP(E6,'Siatka płac'!$B$6:$E$17,3,FALSE))),\"-\")","v":0.15},"I",{"$f":"IF(G6=\"poniżej min.\",((VLOOKUP(E6,'Siatka płac'!$B$6:$D$17,3,FALSE)-C6)*(13-'Zestawienie stanowisk'!$H$1)),\"-\")","v":"-"},null,null,null,null,1,"IV"]
[1,"Spawacz",3500,"Pracownik 3",{"$f":"IFERROR((VLOOKUP(B7,'Zestawienie stanowisk'!$B$5:$E$65,4,FALSE)),\"-\")","v":1},{"$f":"IFERROR(((C7-(VLOOKUP(E7,'Siatka płac'!$B$6:$E$17,3,FALSE)))/(VLOOKUP(E7,'Siatka płac'!$B$6:$E$17,4,FALSE)-VLOOKUP(E7,'Siatka płac'!$B$6:$E$17,3,FALSE))),\"-\")","v":0.75},"III",{"$f":"IF(G7=\"poniżej min.\",((VLOOKUP(E7,'Siatka płac'!$B$6:$D$17,3,FALSE)-C7)*(13-'Zestawienie stanowisk'!$H$1)),\"-\")","v":"-"},null,null,null,null,0.75,"III"]
[1,"Mechanik",1800,"Pracownik 4",{"$f":"IFERROR((VLOOKUP(B8,'Zestawienie stanowisk'!$B$5:$E$65,4,FALSE)),\"-\")","v":1},{"$f":"IFERROR(((C8-(VLOOKUP(E8,'Siatka płac'!$B$6:$E$17,3,FALSE)))/(VLOOKUP(E8,'Siatka płac'!$B$6:$E$17,4,FALSE)-VLOOKUP(E8,'Siatka płac'!$B$6:$E$17,3,FALSE))),\"-\")","v":-0.1},"poniżej min.",{"$f":"IF(G8=\"poniżej min.\",((VLOOKUP(E8,'Siatka płac'!$B$6:$D$17,3,FALSE)-C8)*(13-'Zestawienie stanowisk'!$H$1)),\"-\")","v":200},null,null,null,null,0.5,"II"]
[1,"Elektryk",4500,"Pracownik 5",{"$f":"IFERROR((VLOOKUP(B9,'Zestawienie stanowisk'!$B$5:$E$65,4,FALSE)),\"-\")","v":1},{"$f":"IFERROR(((C9-(VLOOKUP(E9,'Siatka płac'!$B$6:$E$17,3,FALSE)))/(VLOOKUP(E9,'Siatka płac'!$B$6:$E$17,4,FALSE)-VLOOKUP(E9,'Siatka płac'!$B$6:$E$17,3,FALSE))),\"-\")","v":1.25},"powyżej maks.",{"$f":"IF(G9=\"poniżej min.\",((VLOOKUP(E9,'Siatka płac'!$B$6:$D$17,3,FALSE)-C9)*(13-'Zestawienie stanowisk'!$H$1)),\"-\")","v":"-"},null,null,null,null,0.25,"I"]
[1,"Kierowca",3000,"Pracownik 6",{"$f":"IFERROR((VLOOKUP(B10,'Zestawienie stanowisk'!$B$5:$E$65,4,FALSE)),\"-\")","v":1},{"$f":"IFERROR(((C10-(VLOOKUP(E10,'Siatka płac'!$B$6:$E$17,3,FALSE)))/(VLOOKUP(E10,'Siatka płac'!$B$6:$E$17,4,FALSE)-VLOOKUP(E10,'Siatka płac'!$B$6:$E$17,3,FALSE))),\"-\")","v":0.5},"II",{"$f":"IF(G10=\"poniżej min.\",((VLOOKUP(E10,'Siatka płac'!$B$6:$D$17,3,FALSE)-C10)*(13-'Zestawienie stanowisk'!$H$1)),\"-\")","v":"-"},null,null,null,null,0,"poniżej min."]
[1,"Automatyk",4400,"Pracownik 7",{"$f":"IFERROR((VLOOKUP(B11,'Zestawienie stanowisk'!$B$5:$E$65,4,FALSE)),\"-\")","v":1},{"$f":"IFERROR(((C11-(VLOOKUP(E11,'Siatka płac'!$B$6:$E$17,3,FALSE)))/(VLOOKUP(E11,'Siatka płac'!$B$6:$E$17,4,FALSE)-VLOOKUP(E11,'Siatka płac'!$B$6:$E$17,3,FALSE))),\"-\")","v":1.2},"powyżej maks.",{"$f":"IF(G11=\"poniżej min.\",((VLOOKUP(E11,'Siatka płac'!$B$6:$D$17,3,FALSE)-C11)*(13-'Zestawienie stanowisk'!$H$1)),\"-\")","v":"-"}]
[1,"Magazynier",4000,"Pracownik 8",{"$f":"IFERROR((VLOOKUP(B12,'Zestawienie stanowisk'!$B$5:$E$65,4,FALSE)),\"-\")","v":1},{"$f":"IFERROR(((C12-(VLOOKUP(E12,'Siatka płac'!$B$6:$E$17,3,FALSE)))/(VLOOKUP(E12,'Siatka płac'!$B$6:$E$17,4,FALSE)-VLOOKUP(E12,'Siatka płac'!$B$6:$E$17,3,FALSE))),\"-\")","v":1},"IV",{"$f":"IF(G12=\"poniżej min.\",((VLOOKUP(E12,'Siatka płac'!$B$6:$D$17,3,FALSE)-C12)*(13-'Zestawienie stanowisk'!$H$1)),\"-\")","v":"-"}]
[1,"Inżynier procesu",7000,"Pracownik 9",{"$f":"IFERROR((VLOOKUP(B13,'Zestawienie stanowisk'!$B$5:$E$65,4,FALSE)),\"-\")","v":1},{"$f":"IFERROR(((C13-(VLOOKUP(E13,'Siatka płac'!$B$6:$E$17,3,FALSE)))/(VLOOKUP(E13,'Siatka płac'!$B$6:$E$17,4,FALSE)-VLOOKUP(E13,'Siatka płac'!$B$6:$E$17,3,FALSE))),\"-\")","v":2.5},"powyżej maks.",{"$f":"IF(G13=\"poniżej min.\",((VLOOKUP(E13,'Siatka płac'!$B$6:$D$17,3,FALSE)-C13)*(13-'Zestawienie stanowisk'!$H$1)),\"-\")","v":"-"}]
[1,"Mistrz",5500,"Pracownik 10",{"$f":"IFERROR((VLOOKUP(B14,'Zestawienie stanowisk'!$B$5:$E$65,4,FALSE)),\"-\")","v":1},{"$f":"IFERROR(((C14-(VLOOKUP(E14,'Siatka płac'!$B$6:$E$17,3,FALSE)))/(VLOOKUP(E14,'Siatka płac'!$B$6:$E$17,4,FALSE)-VLOOKUP(E14,'Siatka płac'!$B$6:$E$17,3,FALSE))),\"-\")","v":1.75},"powyżej maks.",{"$f":"IF(G14=\"poniżej min.\",((VLOOKUP(E14,'Siatka płac'!$B$6:$D$17,3,FALSE)-C14)*(13-'Zestawienie stanowisk'!$H$1)),\"-\")","v":"-"}]
[1,"Specjalista ds. personalnych",5500,"Pracownik 11",{"$f":"IFERROR((VLOOKUP(B15,'Zestawienie stanowisk'!$B$5:$E$65,4,FALSE)),\"-\")","v":1},{"$f":"IFERROR(((C15-(VLOOKUP(E15,'Siatka płac'!$B$6:$E$17,3,FALSE)))/(VLOOKUP(E15,'Siatka płac'!$B$6:$E$17,4,FALSE)-VLOOKUP(E15,'Siatka płac'!$B$6:$E$17,3,FALSE))),\"-\")","v":1.75},"powyżej maks.",{"$f":"IF(G15=\"poniżej min.\",((VLOOKUP(E15,'Siatka płac'!$B$6:$D$17,3,FALSE)-C15)*(13-'Zestawienie stanowisk'!$H$1)),\"-\")","v":"-"}]
[1,"Administrator serwerów",8000,"Pracownik 12",{"$f":"IFERROR((VLOOKUP(B16,'Zestawienie stanowisk'!$B$5:$E$65,4,FALSE)),\"-\")","v":1},{"$f":"IFERROR(((C16-(VLOOKUP(E16,'Siatka płac'!$B$6:$E$17,3,FALSE)))/(VLOOKUP(E16,'Siatka płac'!$B$6:$E$17,4,FALSE)-VLOOKUP(E16,'Siatka płac'!$B$6:$E$17,3,FALSE))),\"-\")","v":3},"powyżej maks.",{"$f":"IF(G16=\"poniżej min.\",((VLOOKUP(E16,'Siatka płac'!$B$6:$D$17,3,FALSE)-C16)*(13-'Zestawienie stanowisk'!$H$1)),\"-\")","v":"-"}]
[1,"Specjalista ds. księgowych",5000,"Pracownik 13",{"$f":"IFERROR((VLOOKUP(B17,'Zestawienie stanowisk'!$B$5:$E$65,4,FALSE)),\"-\")","v":1},{"$f":"IFERROR(((C17-(VLOOKUP(E17,'Siatka płac'!$B$6:$E$17,3,FALSE)))/(VLOOKUP(E17,'Siatka płac'!$B$6:$E$17,4,FALSE)-VLOOKUP(E17,'Siatka płac'!$B$6:$E$17,3,FALSE))),\"-\")","v":1.5},"powyżej maks.",{"$f":"IF(G17=\"poniżej min.\",((VLOOKUP(E17,'Siatka płac'!$B$6:$D$17,3,FALSE)-C17)*(13-'Zestawienie stanowisk'!$H$1)),\"-\")","v":"-"}]
[1,"Specjalista ds. planowania",5500,"Pracownik 14",{"$f":"IFERROR((VLOOKUP(B18,'Zestawienie stanowisk'!$B$5:$E$65,4,FALSE)),\"-\")","v":1},{"$f":"IFERROR(((C18-(VLOOKUP(E18,'Siatka płac'!$B$6:$E$17,3,FALSE)))/(VLOOKUP(E18,'Siatka płac'!$B$6:$E$17,4,FALSE)-VLOOKUP(E18,'Siatka płac'!$B$6:$E$17,3,FALSE))),\"-\")","v":1.75},"powyżej maks.",{"$f":"IF(G18=\"poniżej min.\",((VLOOKUP(E18,'Siatka płac'!$B$6:$D$17,3,FALSE)-C18)*(13-'Zestawienie stanowisk'!$H$1)),\"-\")","v":"-"}]
[1,"Kierownik produkcji",8000,"Pracownik 15",{"$f":"IFERROR((VLOOKUP(B19,'Zestawienie stanowisk'!$B$5:$E$65,4,FALSE)),\"-\")","v":1},{"$f":"IFERROR(((C19-(VLOOKUP(E19,'Siatka płac'!$B$6:$E$17,3,FALSE)))/(VLOOKUP(E19,'Siatka płac'!$B$6:$E$17,4,FALSE)-VLOOKUP(E19,'Siatka płac'!$B$6:$E$17,3,FALSE))),\"-\")","v":3},"powyżej maks.",{"$f":"IF(G19=\"poniżej min.\",((VLOOKUP(E19,'Siatka płac'!$B$6:$D$17,3,FALSE)-C19)*(13-'Zestawienie stanowisk'!$H$1)),\"-\")","v":"-"}]
[1,"Kierownik działu jakości",12000,"Pracownik 16",{"$f":"IFERROR((VLOOKUP(B20,'Zestawienie stanowisk'!$B$5:$E$65,4,FALSE)),\"-\")","v":1},{"$f":"IFERROR(((C20-(VLOOKUP(E20,'Siatka płac'!$B$6:$E$17,3,FALSE)))/(VLOOKUP(E20,'Siatka płac'!$B$6:$E$17,4,FALSE)-VLOOKUP(E20,'Siatka płac'!$B$6:$E$17,3,FALSE))),\"-\")","v":5},"powyżej maks.",{"$f":"IF(G20=\"poniżej min.\",((VLOOKUP(E20,'Siatka płac'!$B$6:$D$17,3,FALSE)-C20)*(13-'Zestawienie stanowisk'!$H$1)),\"-\")","v":"-"}]
[1,"Kierownik magazynu",10000,"Pracownik 17",{"$f":"IFERROR((VLOOKUP(B21,'Zestawienie stanowisk'!$B$5:$E$65,4,FALSE)),\"-\")","v":1},{"$f":"IFERROR(((C21-(VLOOKUP(E21,'Siatka płac'!$B$6:$E$17,3,FALSE)))/(VLOOKUP(E21,'Siatka płac'!$B$6:$E$17,4,FALSE)-VLOOKUP(E21,'Siatka płac'!$B$6:$E$17,3,FALSE))),\"-\")","v":4},"powyżej maks.",{"$f":"IF(G21=\"poniżej min.\",((VLOOKUP(E21,'Siatka płac'!$B$6:$D$17,3,FALSE)-C21)*(13-'Zestawienie stanowisk'!$H$1)),\"-\")","v":"-"}]
[1,"Dyrektor finansowy",54000,"Pracownik 18",{"$f":"IFERROR((VLOOKUP(B22,'Zestawienie stanowisk'!$B$5:$E$65,4,FALSE)),\"-\")","v":1},{"$f":"IFERROR(((C22-(VLOOKUP(E22,'Siatka płac'!$B$6:$E$17,3,FALSE)))/(VLOOKUP(E22,'Siatka płac'!$B$6:$E$17,4,FALSE)-VLOOKUP(E22,'Siatka płac'!$B$6:$E$17,3,FALSE))),\"-\")","v":26},"-",{"$f":"IF(G22=\"poniżej min.\",((VLOOKUP(E22,'Siatka płac'!$B$6:$D$17,3,FALSE)-C22)*(13-'Zestawienie stanowisk'!$H$1)),\"-\")","v":"-"}]
[1,"Dyrektor produkcji",40000,"Pracownik 19",{"$f":"IFERROR((VLOOKUP(B23,'Zestawienie stanowisk'!$B$5:$E$65,4,FALSE)),\"-\")","v":1},{"$f":"IFERROR(((C23-(VLOOKUP(E23,'Siatka płac'!$B$6:$E$17,3,FALSE)))/(VLOOKUP(E23,'Siatka płac'!$B$6:$E$17,4,FALSE)-VLOOKUP(E23,'Siatka płac'!$B$6:$E$17,3,FALSE))),\"-\")","v":19},"-",{"$f":"IF(G23=\"poniżej min.\",((VLOOKUP(E23,'Siatka płac'!$B$6:$D$17,3,FALSE)-C23)*(13-'Zestawienie stanowisk'!$H$1)),\"-\")","v":"-"}]
[1,"Monter",2500,"Pracownik 20",{"$f":"IFERROR((VLOOKUP(B24,'Zestawienie stanowisk'!$B$5:$E$65,4,FALSE)),\"-\")","v":1},{"$f":"IFERROR(((C24-(VLOOKUP(E24,'Siatka płac'!$B$6:$E$17,3,FALSE)))/(VLOOKUP(E24,'Siatka płac'!$B$6:$E$17,4,FALSE)-VLOOKUP(E24,'Siatka płac'!$B$6:$E$17,3,FALSE))),\"-\")","v":0.25},"I",{"$f":"IF(G24=\"poniżej min.\",((VLOOKUP(E24,'Siatka płac'!$B$6:$D$17,3,FALSE)-C24)*(13-'Zestawienie stanowisk'!$H$1)),\"-\")","v":"-"}]
[1,"Monter",2500,"Pracownik 21",{"$f":"IFERROR((VLOOKUP(B25,'Zestawienie stanowisk'!$B$5:$E$65,4,FALSE)),\"-\")","v":1},{"$f":"IFERROR(((C25-(VLOOKUP(E25,'Siatka płac'!$B$6:$E$17,3,FALSE)))/(VLOOKUP(E25,'Siatka płac'!$B$6:$E$17,4,FALSE)-VLOOKUP(E25,'Siatka płac'!$B$6:$E$17,3,FALSE))),\"-\")","v":0.25},"I",{"$f":"IF(G25=\"poniżej min.\",((VLOOKUP(E25,'Siatka płac'!$B$6:$D$17,3,FALSE)-C25)*(13-'Zestawienie stanowisk'!$H$1)),\"-\")","v":"-"}]
[1,"Spawacz",3500,"Pracownik 22",{"$f":"IFERROR((VLOOKUP(B26,'Zestawienie stanowisk'!$B$5:$E$65,4,FALSE)),\"-\")","v":1},{"$f":"IFERROR(((C26-(VLOOKUP(E26,'Siatka płac'!$B$6:$E$17,3,FALSE)))/(VLOOKUP(E26,'Siatka płac'!$B$6:$E$17,4,FALSE)-VLOOKUP(E26,'Siatka płac'!$B$6:$E$17,3,FALSE))),\"-\")","v":0.75},"III",{"$f":"IF(G26=\"poniżej min.\",((VLOOKUP(E26,'Siatka płac'!$B$6:$D$17,3,FALSE)-C26)*(13-'Zestawienie stanowisk'!$H$1)),\"-\")","v":"-"}]
[1,"Spawacz",3500,"Pracownik 23",{"$f":"IFERROR((VLOOKUP(B27,'Zestawienie stanowisk'!$B$5:$E$65,4,FALSE)),\"-\")","v":1},{"$f":"IFERROR(((C27-(VLOOKUP(E27,'Siatka płac'!$B$6:$E$17,3,FALSE)))/(VLOOKUP(E27,'Siatka płac'!$B$6:$E$17,4,FALSE)-VLOOKUP(E27,'Siatka płac'!$B$6:$E$17,3,FALSE))),\"-\")","v":0.75},"III",{"$f":"IF(G27=\"poniżej min.\",((VLOOKUP(E27,'Siatka płac'!$B$6:$D$17,3,FALSE)-C27)*(13-'Zestawienie stanowisk'!$H$1)),\"-\")","v":"-"}]
[1,"Spawacz",3500,"Pracownik 24",{"$f":"IFERROR((VLOOKUP(B28,'Zestawienie stanowisk'!$B$5:$E$65,4,FALSE)),\"-\")","v":1},{"$f":"IFERROR(((C28-(VLOOKUP(E28,'Siatka płac'!$B$6:$E$17,3,FALSE)))/(VLOOKUP(E28,'Siatka płac'!$B$6:$E$17,4,FALSE)-VLOOKUP(E28,'Siatka płac'!$B$6:$E$17,3,FALSE))),\"-\")","v":0.75},"III",{"$f":"IF(G28=\"poniżej min.\",((VLOOKUP(E28,'Siatka płac'!$B$6:$D$17,3,FALSE)-C28)*(13-'Zestawienie stanowisk'!$H$1)),\"-\")","v":"-"}]
[1,"Spawacz",3500,"Pracownik 25",{"$f":"IFERROR((VLOOKUP(B29,'Zestawienie stanowisk'!$B$5:$E$65,4,FALSE)),\"-\")","v":1},{"$f":"IFERROR(((C29-(VLOOKUP(E29,'Siatka płac'!$B$6:$E$17,3,FALSE)))/(VLOOKUP(E29,'Siatka płac'!$B$6:$E$17,4,FALSE)-VLOOKUP(E29,'Siatka płac'!$B$6:$E$17,3,FALSE))),\"-\")","v":0.75},"III",{"$f":"IF(G29=\"poniżej min.\",((VLOOKUP(E29,'Siatka płac'!$B$6:$D$17,3,FALSE)-C29)*(13-'Zestawienie stanowisk'!$H$1)),\"-\")","v":"-"}]
[1,"Spawacz",3500,"Pracownik 26",{"$f":"IFERROR((VLOOKUP(B30,'Zestawienie stanowisk'!$B$5:$E$65,4,FALSE)),\"-\")","v":1},{"$f":"IFERROR(((C30-(VLOOKUP(E30,'Siatka płac'!$B$6:$E$17,3,FALSE)))/(VLOOKUP(E30,'Siatka płac'!$B$6:$E$17,4,FALSE)-VLOOKUP(E30,'Siatka płac'!$B$6:$E$17,3,FALSE))),\"-\")","v":0.75},"III",{"$f":"IF(G30=\"poniżej min.\",((VLOOKUP(E30,'Siatka płac'!$B$6:$D$17,3,FALSE)-C30)*(13-'Zestawienie stanowisk'!$H$1)),\"-\")","v":"-"}]
[1,"Spawacz",3500,"Pracownik 27",{"$f":"IFERROR((VLOOKUP(B31,'Zestawienie stanowisk'!$B$5:$E$65,4,FALSE)),\"-\")","v":1},{"$f":"IFERROR(((C31-(VLOOKUP(E31,'Siatka płac'!$B$6:$E$17,3,FALSE)))/(VLOOKUP(E31,'Siatka płac'!$B$6:$E$17,4,FALSE)-VLOOKUP(E31,'Siatka płac'!$B$6:$E$17,3,FALSE))),\"-\")","v":0.75},"III",{"$f":"IF(G31=\"poniżej min.\",((VLOOKUP(E31,'Siatka płac'!$B$6:$D$17,3,FALSE)-C31)*(13-'Zestawienie stanowisk'!$H$1)),\"-\")","v":"-"}]
[1,"Spawacz",3500,"Pracownik 28",{"$f":"IFERROR((VLOOKUP(B32,'Zestawienie stanowisk'!$B$5:$E$65,4,FALSE)),\"-\")","v":1},{"$f":"IFERROR(((C32-(VLOOKUP(E32,'Siatka płac'!$B$6:$E$17,3,FALSE)))/(VLOOKUP(E32,'Siatka płac'!$B$6:$E$17,4,FALSE)-VLOOKUP(E32,'Siatka płac'!$B$6:$E$17,3,FALSE))),\"-\")","v":0.75},"III",{"$f":"IF(G32=\"poniżej min.\",((VLOOKUP(E32,'Siatka płac'!$B$6:$D$17,3,FALSE)-C32)*(13-'Zestawienie stanowisk'!$H$1)),\"-\")","v":"-"}]
[1,"Spawacz",3500,"Pracownik 29",{"$f":"IFERROR((VLOOKUP(B33,'Zestawienie stanowisk'!$B$5:$E$65,4,FALSE)),\"-\")","v":1},{"$f":"IFERROR(((C33-(VLOOKUP(E33,'Siatka płac'!$B$6:$E$17,3,FALSE)))/(VLOOKUP(E33,'Siatka płac'!$B$6:$E$17,4,FALSE)-VLOOKUP(E33,'Siatka płac'!$B$6:$E$17,3,FALSE))),\"-\")","v":0.75},"III",{"$f":"IF(G33=\"poniżej min.\",((VLOOKUP(E33,'Siatka płac'!$B$6:$D$17,3,FALSE)-C33)*(13-'Zestawienie stanowisk'!$H$1)),\"-\")","v":"-"}]
[1,"Spawacz",3500,"Pracownik 30",{"$f":"IFERROR((VLOOKUP(B34,'Zestawienie stanowisk'!$B$5:$E$65,4,FALSE)),\"-\")","v":1},{"$f":"IFERROR(((C34-(VLOOKUP(E34,'Siatka płac'!$B$6:$E$17,3,FALSE)))/(VLOOKUP(E34,'Siatka płac'!$B$6:$E$17,4,FALSE)-VLOOKUP(E34,'Siatka płac'!$B$6:$E$17,3,FALSE))),\"-\")","v":0.75},"III",{"$f":"IF(G34=\"poniżej min.\",((VLOOKUP(E34,'Siatka płac'!$B$6:$D$17,3,FALSE)-C34)*(13-'Zestawienie stanowisk'!$H$1)),\"-\")","v":"-"}]
[1,"Spawacz",3500,"Pracownik 31",{"$f":"IFERROR((VLOOKUP(B35,'Zestawienie stanowisk'!$B$5:$E$65,4,FALSE)),\"-\")","v":1},{"$f":"IFERROR(((C35-(VLOOKUP(E35,'Siatka płac'!$B$6:$E$17,3,FALSE)))/(VLOOKUP(E35,'Siatka płac'!$B$6:$E$17,4,FALSE)-VLOOKUP(E35,'Siatka płac'!$B$6:$E$17,3,FALSE))),\"-\")","v":0.75},"III",{"$f":"IF(G35=\"poniżej min.\",((VLOOKUP(E35,'Siatka płac'!$B$6:$D$17,3,FALSE)-C35)*(13-'Zestawienie stanowisk'!$H$1)),\"-\")","v":"-"}]
[1,"Spawacz",4000,"Pracownik 32",{"$f":"IFERROR((VLOOKUP(B36,'Zestawienie stanowisk'!$B$5:$E$65,4,FALSE)),\"-\")","v":1},{"$f":"IFERROR(((C36-(VLOOKUP(E36,'Siatka płac'!$B$6:$E$17,3,FALSE)))/(VLOOKUP(E36,'Siatka płac'!$B$6:$E$17,4,FALSE)-VLOOKUP(E36,'Siatka płac'!$B$6:$E$17,3,FALSE))),\"-\")","v":1},"IV",{"$f":"IF(G36=\"poniżej min.\",((VLOOKUP(E36,'Siatka płac'!$B$6:$D$17,3,FALSE)-C36)*(13-'Zestawienie stanowisk'!$H$1)),\"-\")","v":"-"}]
[1,"Spawacz",4000,"Pracownik 33",{"$f":"IFERROR((VLOOKUP(B37,'Zestawienie stanowisk'!$B$5:$E$65,4,FALSE)),\"-\")","v":1},{"$f":"IFERROR(((C37-(VLOOKUP(E37,'Siatka płac'!$B$6:$E$17,3,FALSE)))/(VLOOKUP(E37,'Siatka płac'!$B$6:$E$17,4,FALSE)-VLOOKUP(E37,'Siatka płac'!$B$6:$E$17,3,FALSE))),\"-\")","v":1},"IV",{"$f":"IF(G37=\"poniżej min.\",((VLOOKUP(E37,'Siatka płac'!$B$6:$D$17,3,FALSE)-C37)*(13-'Zestawienie stanowisk'!$H$1)),\"-\")","v":"-"}]
[1,"Spawacz",4000,"Pracownik 34",{"$f":"IFERROR((VLOOKUP(B38,'Zestawienie stanowisk'!$B$5:$E$65,4,FALSE)),\"-\")","v":1},{"$f":"IFERROR(((C38-(VLOOKUP(E38,'Siatka płac'!$B$6:$E$17,3,FALSE)))/(VLOOKUP(E38,'Siatka płac'!$B$6:$E$17,4,FALSE)-VLOOKUP(E38,'Siatka płac'!$B$6:$E$17,3,FALSE))),\"-\")","v":1},"IV",{"$f":"IF(G38=\"poniżej min.\",((VLOOKUP(E38,'Siatka płac'!$B$6:$D$17,3,FALSE)-C38)*(13-'Zestawienie stanowisk'!$H$1)),\"-\")","v":"-"}]
[1,"Spawacz",4000,"Pracownik 35",{"$f":"IFERROR((VLOOKUP(B39,'Zestawienie stanowisk'!$B$5:$E$65,4,FALSE)),\"-\")","v":1},{"$f":"IFERROR(((C39-(VLOOKUP(E39,'Siatka płac'!$B$6:$E$17,3,FALSE)))/(VLOOKUP(E39,'Siatka płac'!$B$6:$E$17,4,FALSE)-VLOOKUP(E39,'Siatka płac'!$B$6:$E$17,3,FALSE))),\"-\")","v":1},"IV",{"$f":"IF(G39=\"poniżej min.\",((VLOOKUP(E39,'Siatka płac'!$B$6:$D$17,3,FALSE)-C39)*(13-'Zestawienie stanowisk'!$H$1)),\"-\")","v":"-"}]
[1,"Spawacz",4000,"Pracownik 36",{"$f":"IFERROR((VLOOKUP(B40,'Zestawienie stanowisk'!$B$5:$E$65,4,FALSE)),\"-\")","v":1},{"$f":"IFERROR(((C40-(VLOOKUP(E40,'Siatka płac'!$B$6:$E$17,3,FALSE)))/(VLOOKUP(E40,'Siatka płac'!$B$6:$E$17,4,FALSE)-VLOOKUP(E40,'Siatka płac'!$B$6:$E$17,3,FALSE))),\"-\")","v":1},"IV",{"$f":"IF(G40=\"poniżej min.\",((VLOOKUP(E40,'Siatka płac'!$B$6:$D$17,3,FALSE)-C40)*(13-'Zestawienie stanowisk'!$H$1)),\"-\")","v":"-"}]
[1,"Spawacz",4000,"Pracownik 37",{"$f":"IFERROR((VLOOKUP(B41,'Zestawienie stanowisk'!$B$5:$E$65,4,FALSE)),\"-\")","v":1},{"$f":"IFERROR(((C41-(VLOOKUP(E41,'Siatka płac'!$B$6:$E$17,3,FALSE)))/(VLOOKUP(E41,'Siatka płac'!$B$6:$E$17,4,FALSE)-VLOOKUP(E41,'Siatka płac'!$B$6:$E$17,3,FALSE))),\"-\")","v":1},"IV",{"$f":"IF(G41=\"poniżej min.\",((VLOOKUP(E41,'Siatka płac'!$B$6:$D$17,3,FALSE)-C41)*(13-'Zestawienie stanowisk'!$H$1)),\"-\")","v":"-"}]
[1,"Spawacz",4000,"Pracownik 38",{"$f":"IFERROR((VLOOKUP(B42,'Zestawienie stanowisk'!$B$5:$E$65,4,FALSE)),\"-\")","v":1},{"$f":"IFERROR(((C42-(VLOOKUP(E42,'Siatka płac'!$B$6:$E$17,3,FALSE)))/(VLOOKUP(E42,'Siatka płac'!$B$6:$E$17,4,FALSE)-VLOOKUP(E42,'Siatka płac'!$B$6:$E$17,3,FALSE))),\"-\")","v":1},"IV",{"$f":"IF(G42=\"poniżej min.\",((VLOOKUP(E42,'Siatka płac'!$B$6:$D$17,3,FALSE)-C42)*(13-'Zestawienie stanowisk'!$H$1)),\"-\")","v":"-"}]
[1,"Spawacz",4000,"Pracownik 39",{"$f":"IFERROR((VLOOKUP(B43,'Zestawienie stanowisk'!$B$5:$E$65,4,FALSE)),\"-\")","v":1},{"$f":"IFERROR(((C43-(VLOOKUP(E43,'Siatka płac'!$B$6:$E$17,3,FALSE)))/(VLOOKUP(E43,'Siatka płac'!$B$6:$E$17,4,FALSE)-VLOOKUP(E43,'Siatka płac'!$B$6:$E$17,3,FALSE))),\"-\")","v":1},"IV",{"$f":"IF(G43=\"poniżej min.\",((VLOOKUP(E43,'Siatka płac'!$B$6:$D$17,3,FALSE)-C43)*(13-'Zestawienie stanowisk'!$H$1)),\"-\")","v":"-"}]
[1,"Spawacz",4000,"Pracownik 40",{"$f":"IFERROR((VLOOKUP(B44,'Zestawienie stanowisk'!$B$5:$E$65,4,FALSE)),\"-\")","v":1},{"$f":"IFERROR(((C44-(VLOOKUP(E44,'Siatka płac'!$B$6:$E$17,3,FALSE)))/(VLOOKUP(E44,'Siatka płac'!$B$6:$E$17,4,FALSE)-VLOOKUP(E44,'Siatka płac'!$B$6:$E$17,3,FALSE))),\"-\")","v":1},"IV",{"$f":"IF(G44=\"poniżej min.\",((VLOOKUP(E44,'Siatka płac'!$B$6:$D$17,3,FALSE)-C44)*(13-'Zestawienie stanowisk'!$H$1)),\"-\")","v":"-"}]
[1,"Spawacz",4000,"Pracownik 41",{"$f":"IFERROR((VLOOKUP(B45,'Zestawienie stanowisk'!$B$5:$E$65,4,FALSE)),\"-\")","v":1},{"$f":"IFERROR(((C45-(VLOOKUP(E45,'Siatka płac'!$B$6:$E$17,3,FALSE)))/(VLOOKUP(E45,'Siatka płac'!$B$6:$E$17,4,FALSE)-VLOOKUP(E45,'Siatka płac'!$B$6:$E$17,3,FALSE))),\"-\")","v":1},"IV",{"$f":"IF(G45=\"poniżej min.\",((VLOOKUP(E45,'Siatka płac'!$B$6:$D$17,3,FALSE)-C45)*(13-'Zestawienie stanowisk'!$H$1)),\"-\")","v":"-"}]
[1,"Spawacz",4000,"Pracownik 42",{"$f":"IFERROR((VLOOKUP(B46,'Zestawienie stanowisk'!$B$5:$E$65,4,FALSE)),\"-\")","v":1},{"$f":"IFERROR(((C46-(VLOOKUP(E46,'Siatka płac'!$B$6:$E$17,3,FALSE)))/(VLOOKUP(E46,'Siatka płac'!$B$6:$E$17,4,FALSE)-VLOOKUP(E46,'Siatka płac'!$B$6:$E$17,3,FALSE))),\"-\")","v":1},"IV",{"$f":"IF(G46=\"poniżej min.\",((VLOOKUP(E46,'Siatka płac'!$B$6:$D$17,3,FALSE)-C46)*(13-'Zestawienie stanowisk'!$H$1)),\"-\")","v":"-"}]
[1,"Spawacz",4000,"Pracownik 43",{"$f":"IFERROR((VLOOKUP(B47,'Zestawienie stanowisk'!$B$5:$E$65,4,FALSE)),\"-\")","v":1},{"$f":"IFERROR(((C47-(VLOOKUP(E47,'Siatka płac'!$B$6:$E$17,3,FALSE)))/(VLOOKUP(E47,'Siatka płac'!$B$6:$E$17,4,FALSE)-VLOOKUP(E47,'Siatka płac'!$B$6:$E$17,3,FALSE))),\"-\")","v":1},"IV",{"$f":"IF(G47=\"poniżej min.\",((VLOOKUP(E47,'Siatka płac'!$B$6:$D$17,3,FALSE)-C47)*(13-'Zestawienie stanowisk'!$H$1)),\"-\")","v":"-"}]
[1,"Spawacz",4500,"Pracownik 44",{"$f":"IFERROR((VLOOKUP(B48,'Zestawienie stanowisk'!$B$5:$E$65,4,FALSE)),\"-\")","v":1},{"$f":"IFERROR(((C48-(VLOOKUP(E48,'Siatka płac'!$B$6:$E$17,3,FALSE)))/(VLOOKUP(E48,'Siatka płac'!$B$6:$E$17,4,FALSE)-VLOOKUP(E48,'Siatka płac'!$B$6:$E$17,3,FALSE))),\"-\")","v":1.25},"powyżej maks.",{"$f":"IF(G48=\"poniżej min.\",((VLOOKUP(E48,'Siatka płac'!$B$6:$D$17,3,FALSE)-C48)*(13-'Zestawienie stanowisk'!$H$1)),\"-\")","v":"-"}]
[1,"Spawacz",4500,"Pracownik 45",{"$f":"IFERROR((VLOOKUP(B49,'Zestawienie stanowisk'!$B$5:$E$65,4,FALSE)),\"-\")","v":1},{"$f":"IFERROR(((C49-(VLOOKUP(E49,'Siatka płac'!$B$6:$E$17,3,FALSE)))/(VLOOKUP(E49,'Siatka płac'!$B$6:$E$17,4,FALSE)-VLOOKUP(E49,'Siatka płac'!$B$6:$E$17,3,FALSE))),\"-\")","v":1.25},"powyżej maks.",{"$f":"IF(G49=\"poniżej min.\",((VLOOKUP(E49,'Siatka płac'!$B$6:$D$17,3,FALSE)-C49)*(13-'Zestawienie stanowisk'!$H$1)),\"-\")","v":"-"}]
[1,"Spawacz",4500,"Pracownik 46",{"$f":"IFERROR((VLOOKUP(B50,'Zestawienie stanowisk'!$B$5:$E$65,4,FALSE)),\"-\")","v":1},{"$f":"IFERROR(((C50-(VLOOKUP(E50,'Siatka płac'!$B$6:$E$17,3,FALSE)))/(VLOOKUP(E50,'Siatka płac'!$B$6:$E$17,4,FALSE)-VLOOKUP(E50,'Siatka płac'!$B$6:$E$17,3,FALSE))),\"-\")","v":1.25},"powyżej maks.",{"$f":"IF(G50=\"poniżej min.\",((VLOOKUP(E50,'Siatka płac'!$B$6:$D$17,3,FALSE)-C50)*(13-'Zestawienie stanowisk'!$H$1)),\"-\")","v":"-"}]
[1,"Spawacz",4500,"Pracownik 47",{"$f":"IFERROR((VLOOKUP(B51,'Zestawienie stanowisk'!$B$5:$E$65,4,FALSE)),\"-\")","v":1},{"$f":"IFERROR(((C51-(VLOOKUP(E51,'Siatka płac'!$B$6:$E$17,3,FALSE)))/(VLOOKUP(E51,'Siatka płac'!$B$6:$E$17,4,FALSE)-VLOOKUP(E51,'Siatka płac'!$B$6:$E$17,3,FALSE))),\"-\")","v":1.25},"powyżej maks.",{"$f":"IF(G51=\"poniżej min.\",((VLOOKUP(E51,'Siatka płac'!$B$6:$D$17,3,FALSE)-C51)*(13-'Zestawienie stanowisk'!$H$1)),\"-\")","v":"-"}]
[1,"Spawacz",4500,"Pracownik 48",{"$f":"IFERROR((VLOOKUP(B52,'Zestawienie stanowisk'!$B$5:$E$65,4,FALSE)),\"-\")","v":1},{"$f":"IFERROR(((C52-(VLOOKUP(E52,'Siatka płac'!$B$6:$E$17,3,FALSE)))/(VLOOKUP(E52,'Siatka płac'!$B$6:$E$17,4,FALSE)-VLOOKUP(E52,'Siatka płac'!$B$6:$E$17,3,FALSE))),\"-\")","v":1.25},"powyżej maks.",{"$f":"IF(G52=\"poniżej min.\",((VLOOKUP(E52,'Siatka płac'!$B$6:$D$17,3,FALSE)-C52)*(13-'Zestawienie stanowisk'!$H$1)),\"-\")","v":"-"}]
[1,"Spawacz",4500,"Pracownik 49",{"$f":"IFERROR((VLOOKUP(B53,'Zestawienie stanowisk'!$B$5:$E$65,4,FALSE)),\"-\")","v":1},{"$f":"IFERROR(((C53-(VLOOKUP(E53,'Siatka płac'!$B$6:$E$17,3,FALSE)))/(VLOOKUP(E53,'Siatka płac'!$B$6:$E$17,4,FALSE)-VLOOKUP(E53,'Siatka płac'!$B$6:$E$17,3,FALSE))),\"-\")","v":1.25},"powyżej maks.",{"$f":"IF(G53=\"poniżej min.\",((VLOOKUP(E53,'Siatka płac'!$B$6:$D$17,3,FALSE)-C53)*(13-'Zestawienie stanowisk'!$H$1)),\"-\")","v":"-"}]
[1,"Spawacz",4500,"Pracownik 50",{"$f":"IFERROR((VLOOKUP(B54,'Zestawienie stanowisk'!$B$5:$E$65,4,FALSE)),\"-\")","v":1},{"$f":"IFERROR(((C54-(VLOOKUP(E54,'Siatka płac'!$B$6:$E$17,3,FALSE)))/(VLOOKUP(E54,'Siatka płac'!$B$6:$E$17,4,FALSE)-VLOOKUP(E54,'Siatka płac'!$B$6:$E$17,3,FALSE))),\"-\")","v":1.25},"powyżej maks.",{"$f":"IF(G54=\"poniżej min.\",((VLOOKUP(E54,'Siatka płac'!$B$6:$D$17,3,FALSE)-C54)*(13-'Zestawienie stanowisk'!$H$1)),\"-\")","v":"-"}]
[1,"Spawacz",4500,"Pracownik 51",{"$f":"IFERROR((VLOOKUP(B55,'Zestawienie stanowisk'!$B$5:$E$65,4,FALSE)),\"-\")","v":1},{"$f":"IFERROR(((C55-(VLOOKUP(E55,'Siatka płac'!$B$6:$E$17,3,FALSE)))/(VLOOKUP(E55,'Siatka płac'!$B$6:$E$17,4,FALSE)-VLOOKUP(E55,'Siatka płac'!$B$6:$E$17,3,FALSE))),\"-\")","v":1.25},"powyżej maks.",{"$f":"IF(G55=\"poniżej min.\",((VLOOKUP(E55,'Siatka płac'!$B$6:$D$17,3,FALSE)-C55)*(13-'Zestawienie stanowisk'!$H$1)),\"-\")","v":"-"}]
[1,"Spawacz",4500,"Pracownik 52",{"$f":"IFERROR((VLOOKUP(B56,'Zestawienie stanowisk'!$B$5:$E$65,4,FALSE)),\"-\")","v":1},{"$f":"IFERROR(((C56-(VLOOKUP(E56,'Siatka płac'!$B$6:$E$17,3,FALSE)))/(VLOOKUP(E56,'Siatka płac'!$B$6:$E$17,4,FALSE)-VLOOKUP(E56,'Siatka płac'!$B$6:$E$17,3,FALSE))),\"-\")","v":1.25},"powyżej maks.",{"$f":"IF(G56=\"poniżej min.\",((VLOOKUP(E56,'Siatka płac'!$B$6:$D$17,3,FALSE)-C56)*(13-'Zestawienie stanowisk'!$H$1)),\"-\")","v":"-"}]
[1,"Spawacz",5000,"Pracownik 53",{"$f":"IFERROR((VLOOKUP(B57,'Zestawienie stanowisk'!$B$5:$E$65,4,FALSE)),\"-\")","v":1},{"$f":"IFERROR(((C57-(VLOOKUP(E57,'Siatka płac'!$B$6:$E$17,3,FALSE)))/(VLOOKUP(E57,'Siatka płac'!$B$6:$E$17,4,FALSE)-VLOOKUP(E57,'Siatka płac'!$B$6:$E$17,3,FALSE))),\"-\")","v":1.5},"powyżej maks.",{"$f":"IF(G57=\"poniżej min.\",((VLOOKUP(E57,'Siatka płac'!$B$6:$D$17,3,FALSE)-C57)*(13-'Zestawienie stanowisk'!$H$1)),\"-\")","v":"-"}]
[1,"Spawacz",5000,"Pracownik 54",{"$f":"IFERROR((VLOOKUP(B58,'Zestawienie stanowisk'!$B$5:$E$65,4,FALSE)),\"-\")","v":1},{"$f":"IFERROR(((C58-(VLOOKUP(E58,'Siatka płac'!$B$6:$E$17,3,FALSE)))/(VLOOKUP(E58,'Siatka płac'!$B$6:$E$17,4,FALSE)-VLOOKUP(E58,'Siatka płac'!$B$6:$E$17,3,FALSE))),\"-\")","v":1.5},"powyżej maks.",{"$f":"IF(G58=\"poniżej min.\",((VLOOKUP(E58,'Siatka płac'!$B$6:$D$17,3,FALSE)-C58)*(13-'Zestawienie stanowisk'!$H$1)),\"-\")","v":"-"}]
[1,"Spawacz",5000,"Pracownik 55",{"$f":"IFERROR((VLOOKUP(B59,'Zestawienie stanowisk'!$B$5:$E$65,4,FALSE)),\"-\")","v":1},{"$f":"IFERROR(((C59-(VLOOKUP(E59,'Siatka płac'!$B$6:$E$17,3,FALSE)))/(VLOOKUP(E59,'Siatka płac'!$B$6:$E$17,4,FALSE)-VLOOKUP(E59,'Siatka płac'!$B$6:$E$17,3,FALSE))),\"-\")","v":1.5},"powyżej maks.",{"$f":"IF(G59=\"poniżej min.\",((VLOOKUP(E59,'Siatka płac'!$B$6:$D$17,3,FALSE)-C59)*(13-'Zestawienie stanowisk'!$H$1)),\"-\")","v":"-"}]
[1,"Spawacz",5000,"Pracownik 56",{"$f":"IFERROR((VLOOKUP(B60,'Zestawienie stanowisk'!$B$5:$E$65,4,FALSE)),\"-\")","v":1},{"$f":"IFERROR(((C60-(VLOOKUP(E60,'Siatka płac'!$B$6:$E$17,3,FALSE)))/(VLOOKUP(E60,'Siatka płac'!$B$6:$E$17,4,FALSE)-VLOOKUP(E60,'Siatka płac'!$B$6:$E$17,3,FALSE))),\"-\")","v":1.5},"powyżej maks.",{"$f":"IF(G60=\"poniżej min.\",((VLOOKUP(E60,'Siatka płac'!$B$6:$D$17,3,FALSE)-C60)*(13-'Zestawienie stanowisk'!$H$1)),\"-\")","v":"-"}]
[1,"Spawacz",5000,"Pracownik 57",{"$f":"IFERROR((VLOOKUP(B61,'Zestawienie stanowisk'!$B$5:$E$65,4,FALSE)),\"-\")","v":1},{"$f":"IFERROR(((C61-(VLOOKUP(E61,'Siatka płac'!$B$6:$E$17,3,FALSE)))/(VLOOKUP(E61,'Siatka płac'!$B$6:$E$17,4,FALSE)-VLOOKUP(E61,'Siatka płac'!$B$6:$E$17,3,FALSE))),\"-\")","v":1.5},"powyżej maks.",{"$f":"IF(G61=\"poniżej min.\",((VLOOKUP(E61,'Siatka płac'!$B$6:$D$17,3,FALSE)-C61)*(13-'Zestawienie stanowisk'!$H$1)),\"-\")","v":"-"}]
[1,"Spawacz",5000,"Pracownik 58",{"$f":"IFERROR((VLOOKUP(B62,'Zestawienie stanowisk'!$B$5:$E$65,4,FALSE)),\"-\")","v":1},{"$f":"IFERROR(((C62-(VLOOKUP(E62,'Siatka płac'!$B$6:$E$17,3,FALSE)))/(VLOOKUP(E62,'Siatka płac'!$B$6:$E$17,4,FALSE)-VLOOKUP(E62,'Siatka płac'!$B$6:$E$17,3,FALSE))),\"-\")","v":1.5},"powyżej maks.",{"$f":"IF(G62=\"poniżej min.\",((VLOOKUP(E62,'Siatka płac'!$B$6:$D$17,3,FALSE)-C62)*(13-'Zestawienie stanowisk'!$H$1)),\"-\")","v":"-"}]
[1,"Spawacz",5000,"Pracownik 59",{"$f":"IFERROR((VLOOKUP(B63,'Zestawienie stanowisk'!$B$5:$E$65,4,FALSE)),\"-\")","v":1},{"$f":"IFERROR(((C63-(VLOOKUP(E63,'Siatka płac'!$B$6:$E$17,3,FALSE)))/(VLOOKUP(E63,'Siatka płac'!$B$6:$E$17,4,FALSE)-VLOOKUP(E63,'Siatka płac'!$B$6:$E$17,3,FALSE))),\"-\")","v":1.5},"powyżej maks.",{"$f":"IF(G63=\"poniżej min.\",((VLOOKUP(E63,'Siatka płac'!$B$6:$D$17,3,FALSE)-C63)*(13-'Zestawienie stanowisk'!$H$1)),\"-\")","v":"-"}]
[1,"Spawacz",5000,"Pracownik 60",{"$f":"IFERROR((VLOOKUP(B64,'Zestawienie stanowisk'!$B$5:$E$65,4,FALSE)),\"-\")","v":1},{"$f":"IFERROR(((C64-(VLOOKUP(E64,'Siatka płac'!$B$6:$E$17,3,FALSE)))/(VLOOKUP(E64,'Siatka płac'!$B$6:$E$17,4,FALSE)-VLOOKUP(E64,'Siatka płac'!$B$6:$E$17,3,FALSE))),\"-\")","v":1.5},"powyżej maks.",{"$f":"IF(G64=\"poniżej min.\",((VLOOKUP(E64,'Siatka płac'!$B$6:$D$17,3,FALSE)-C64)*(13-'Zestawienie stanowisk'!$H$1)),\"-\")","v":"-"}]
[1,"Spawacz",5000,"Pracownik 61",{"$f":"IFERROR((VLOOKUP(B65,'Zestawienie stanowisk'!$B$5:$E$65,4,FALSE)),\"-\")","v":1},{"$f":"IFERROR(((C65-(VLOOKUP(E65,'Siatka płac'!$B$6:$E$17,3,FALSE)))/(VLOOKUP(E65,'Siatka płac'!$B$6:$E$17,4,FALSE)-VLOOKUP(E65,'Siatka płac'!$B$6:$E$17,3,FALSE))),\"-\")","v":1.5},"powyżej maks.",{"$f":"IF(G65=\"poniżej min.\",((VLOOKUP(E65,'Siatka płac'!$B$6:$D$17,3,FALSE)-C65)*(13-'Zestawienie stanowisk'!$H$1)),\"-\")","v":"-"}]
[1,"Monter",2500,"Pracownik 62",{"$f":"IFERROR((VLOOKUP(B66,'Zestawienie stanowisk'!$B$5:$E$65,4,FALSE)),\"-\")","v":1},{"$f":"IFERROR(((C66-(VLOOKUP(E66,'Siatka płac'!$B$6:$E$17,3,FALSE)))/(VLOOKUP(E66,'Siatka płac'!$B$6:$E$17,4,FALSE)-VLOOKUP(E66,'Siatka płac'!$B$6:$E$17,3,FALSE))),\"-\")","v":0.25},"I",{"$f":"IF(G66=\"poniżej min.\",((VLOOKUP(E66,'Siatka płac'!$B$6:$D$17,3,FALSE)-C66)*(13-'Zestawienie stanowisk'!$H$1)),\"-\")","v":"-"}]
[1,"Monter",2500,"Pracownik 63",{"$f":"IFERROR((VLOOKUP(B67,'Zestawienie stanowisk'!$B$5:$E$65,4,FALSE)),\"-\")","v":1},{"$f":"IFERROR(((C67-(VLOOKUP(E67,'Siatka płac'!$B$6:$E$17,3,FALSE)))/(VLOOKUP(E67,'Siatka płac'!$B$6:$E$17,4,FALSE)-VLOOKUP(E67,'Siatka płac'!$B$6:$E$17,3,FALSE))),\"-\")","v":0.25},"I",{"$f":"IF(G67=\"poniżej min.\",((VLOOKUP(E67,'Siatka płac'!$B$6:$D$17,3,FALSE)-C67)*(13-'Zestawienie stanowisk'!$H$1)),\"-\")","v":"-"}]
[1,"Inżynier procesu",5000,"Pracownik 64",{"$f":"IFERROR((VLOOKUP(B68,'Zestawienie stanowisk'!$B$5:$E$65,4,FALSE)),\"-\")","v":1},{"$f":"IFERROR(((C68-(VLOOKUP(E68,'Siatka płac'!$B$6:$E$17,3,FALSE)))/(VLOOKUP(E68,'Siatka płac'!$B$6:$E$17,4,FALSE)-VLOOKUP(E68,'Siatka płac'!$B$6:$E$17,3,FALSE))),\"-\")","v":1.5},"powyżej maks.",{"$f":"IF(G68=\"poniżej min.\",((VLOOKUP(E68,'Siatka płac'!$B$6:$D$17,3,FALSE)-C68)*(13-'Zestawienie stanowisk'!$H$1)),\"-\")","v":"-"}]
[{"$f":"IF(ISBLANK(B69),0,1)","v":1},"Inżynier procesu",5500,"Pracownik 65",{"$f":"IFERROR((VLOOKUP(B69,'Zestawienie stanowisk'!$B$5:$E$65,4,FALSE)),\"-\")","v":1},{"$f":"IFERROR(((C69-(VLOOKUP(E69,'Siatka płac'!$B$6:$E$17,3,FALSE)))/(VLOOKUP(E69,'Siatka płac'!$B$6:$E$17,4,FALSE)-VLOOKUP(E69,'Siatka płac'!$B$6:$E$17,3,FALSE))),\"-\")","v":1.75},{"$f":"IFERROR((INDEX($N$5:$N$10,MATCH(F69,$M$5:$M$10,-1))),\"-\")","v":"powyżej maks."},{"$f":"IF(G69=\"poniżej min.\",((VLOOKUP(E69,'Siatka płac'!$B$6:$D$17,3,FALSE)-C69)*(13-'Zestawienie stanowisk'!$H$1)),\"-\")","v":"-"}]
[1,"Inżynier procesu",5800,"Pracownik 66",{"$f":"IFERROR((VLOOKUP(B70,'Zestawienie stanowisk'!$B$5:$E$65,4,FALSE)),\"-\")","v":1},{"$f":"IFERROR(((C70-(VLOOKUP(E70,'Siatka płac'!$B$6:$E$17,3,FALSE)))/(VLOOKUP(E70,'Siatka płac'!$B$6:$E$17,4,FALSE)-VLOOKUP(E70,'Siatka płac'!$B$6:$E$17,3,FALSE))),\"-\")","v":1.9},"powyżej maks.",{"$f":"IF(G70=\"poniżej min.\",((VLOOKUP(E70,'Siatka płac'!$B$6:$D$17,3,FALSE)-C70)*(13-'Zestawienie stanowisk'!$H$1)),\"-\")","v":"-"}]
[1,"Inżynier procesu",5000,"Pracownik 67",{"$f":"IFERROR((VLOOKUP(B71,'Zestawienie stanowisk'!$B$5:$E$65,4,FALSE)),\"-\")","v":1},{"$f":"IFERROR(((C71-(VLOOKUP(E71,'Siatka płac'!$B$6:$E$17,3,FALSE)))/(VLOOKUP(E71,'Siatka płac'!$B$6:$E$17,4,FALSE)-VLOOKUP(E71,'Siatka płac'!$B$6:$E$17,3,FALSE))),\"-\")","v":1.5},"powyżej maks.",{"$f":"IF(G71=\"poniżej min.\",((VLOOKUP(E71,'Siatka płac'!$B$6:$D$17,3,FALSE)-C71)*(13-'Zestawienie stanowisk'!$H$1)),\"-\")","v":"-"}]
[1,"Inżynier procesu",6000,"Pracownik 68",{"$f":"IFERROR((VLOOKUP(B72,'Zestawienie stanowisk'!$B$5:$E$65,4,FALSE)),\"-\")","v":1},{"$f":"IFERROR(((C72-(VLOOKUP(E72,'Siatka płac'!$B$6:$E$17,3,FALSE)))/(VLOOKUP(E72,'Siatka płac'!$B$6:$E$17,4,FALSE)-VLOOKUP(E72,'Siatka płac'!$B$6:$E$17,3,FALSE))),\"-\")","v":2},"powyżej maks.",{"$f":"IF(G72=\"poniżej min.\",((VLOOKUP(E72,'Siatka płac'!$B$6:$D$17,3,FALSE)-C72)*(13-'Zestawienie stanowisk'!$H$1)),\"-\")","v":"-"}]
[1,"Inżynier procesu",8000,"Pracownik 69",{"$f":"IFERROR((VLOOKUP(B73,'Zestawienie stanowisk'!$B$5:$E$65,4,FALSE)),\"-\")","v":1},{"$f":"IFERROR(((C73-(VLOOKUP(E73,'Siatka płac'!$B$6:$E$17,3,FALSE)))/(VLOOKUP(E73,'Siatka płac'!$B$6:$E$17,4,FALSE)-VLOOKUP(E73,'Siatka płac'!$B$6:$E$17,3,FALSE))),\"-\")","v":3},"powyżej maks.",{"$f":"IF(G73=\"poniżej min.\",((VLOOKUP(E73,'Siatka płac'!$B$6:$D$17,3,FALSE)-C73)*(13-'Zestawienie stanowisk'!$H$1)),\"-\")","v":"-"}]
[1,"Inżynier procesu",7700,"Pracownik 70",{"$f":"IFERROR((VLOOKUP(B74,'Zestawienie stanowisk'!$B$5:$E$65,4,FALSE)),\"-\")","v":1},{"$f":"IFERROR(((C74-(VLOOKUP(E74,'Siatka płac'!$B$6:$E$17,3,FALSE)))/(VLOOKUP(E74,'Siatka płac'!$B$6:$E$17,4,FALSE)-VLOOKUP(E74,'Siatka płac'!$B$6:$E$17,3,FALSE))),\"-\")","v":2.85},"powyżej maks.",{"$f":"IF(G74=\"poniżej min.\",((VLOOKUP(E74,'Siatka płac'!$B$6:$D$17,3,FALSE)-C74)*(13-'Zestawienie stanowisk'!$H$1)),\"-\")","v":"-"}]
[1,"Inżynier procesu",7500,"Pracownik 71",{"$f":"IFERROR((VLOOKUP(B75,'Zestawienie stanowisk'!$B$5:$E$65,4,FALSE)),\"-\")","v":1},{"$f":"IFERROR(((C75-(VLOOKUP(E75,'Siatka płac'!$B$6:$E$17,3,FALSE)))/(VLOOKUP(E75,'Siatka płac'!$B$6:$E$17,4,FALSE)-VLOOKUP(E75,'Siatka płac'!$B$6:$E$17,3,FALSE))),\"-\")","v":2.75},"powyżej maks.",{"$f":"IF(G75=\"poniżej min.\",((VLOOKUP(E75,'Siatka płac'!$B$6:$D$17,3,FALSE)-C75)*(13-'Zestawienie stanowisk'!$H$1)),\"-\")","v":"-"}]
[1,"Inżynier procesu",6000,"Pracownik 72",{"$f":"IFERROR((VLOOKUP(B76,'Zestawienie stanowisk'!$B$5:$E$65,4,FALSE)),\"-\")","v":1},{"$f":"IFERROR(((C76-(VLOOKUP(E76,'Siatka płac'!$B$6:$E$17,3,FALSE)))/(VLOOKUP(E76,'Siatka płac'!$B$6:$E$17,4,FALSE)-VLOOKUP(E76,'Siatka płac'!$B$6:$E$17,3,FALSE))),\"-\")","v":2},"powyżej maks.",{"$f":"IF(G76=\"poniżej min.\",((VLOOKUP(E76,'Siatka płac'!$B$6:$D$17,3,FALSE)-C76)*(13-'Zestawienie stanowisk'!$H$1)),\"-\")","v":"-"}]
[1,"Monter",2500,"Pracownik 73",{"$f":"IFERROR((VLOOKUP(B77,'Zestawienie stanowisk'!$B$5:$E$65,4,FALSE)),\"-\")","v":1},{"$f":"IFERROR(((C77-(VLOOKUP(E77,'Siatka płac'!$B$6:$E$17,3,FALSE)))/(VLOOKUP(E77,'Siatka płac'!$B$6:$E$17,4,FALSE)-VLOOKUP(E77,'Siatka płac'!$B$6:$E$17,3,FALSE))),\"-\")","v":0.25},"I",{"$f":"IF(G77=\"poniżej min.\",((VLOOKUP(E77,'Siatka płac'!$B$6:$D$17,3,FALSE)-C77)*(13-'Zestawienie stanowisk'!$H$1)),\"-\")","v":"-"}]
[1,"Monter",2500,"Pracownik 74",{"$f":"IFERROR((VLOOKUP(B78,'Zestawienie stanowisk'!$B$5:$E$65,4,FALSE)),\"-\")","v":1},{"$f":"IFERROR(((C78-(VLOOKUP(E78,'Siatka płac'!$B$6:$E$17,3,FALSE)))/(VLOOKUP(E78,'Siatka płac'!$B$6:$E$17,4,FALSE)-VLOOKUP(E78,'Siatka płac'!$B$6:$E$17,3,FALSE))),\"-\")","v":0.25},"I",{"$f":"IF(G78=\"poniżej min.\",((VLOOKUP(E78,'Siatka płac'!$B$6:$D$17,3,FALSE)-C78)*(13-'Zestawienie stanowisk'!$H$1)),\"-\")","v":"-"}]
[1,"Magazynier",2600,"Pracownik 75",{"$f":"IFERROR((VLOOKUP(B79,'Zestawienie stanowisk'!$B$5:$E$65,4,FALSE)),\"-\")","v":1},{"$f":"IFERROR(((C79-(VLOOKUP(E79,'Siatka płac'!$B$6:$E$17,3,FALSE)))/(VLOOKUP(E79,'Siatka płac'!$B$6:$E$17,4,FALSE)-VLOOKUP(E79,'Siatka płac'!$B$6:$E$17,3,FALSE))),\"-\")","v":0.3},"II",{"$f":"IF(G79=\"poniżej min.\",((VLOOKUP(E79,'Siatka płac'!$B$6:$D$17,3,FALSE)-C79)*(13-'Zestawienie stanowisk'!$H$1)),\"-\")","v":"-"}]
[1,"Magazynier",2600,"Pracownik 76",{"$f":"IFERROR((VLOOKUP(B80,'Zestawienie stanowisk'!$B$5:$E$65,4,FALSE)),\"-\")","v":1},{"$f":"IFERROR(((C80-(VLOOKUP(E80,'Siatka płac'!$B$6:$E$17,3,FALSE)))/(VLOOKUP(E80,'Siatka płac'!$B$6:$E$17,4,FALSE)-VLOOKUP(E80,'Siatka płac'!$B$6:$E$17,3,FALSE))),\"-\")","v":0.3},"II",{"$f":"IF(G80=\"poniżej min.\",((VLOOKUP(E80,'Siatka płac'!$B$6:$D$17,3,FALSE)-C80)*(13-'Zestawienie stanowisk'!$H$1)),\"-\")","v":"-"}]
[1,"Magazynier",2600,"Pracownik 77",{"$f":"IFERROR((VLOOKUP(B81,'Zestawienie stanowisk'!$B$5:$E$65,4,FALSE)),\"-\")","v":1},{"$f":"IFERROR(((C81-(VLOOKUP(E81,'Siatka płac'!$B$6:$E$17,3,FALSE)))/(VLOOKUP(E81,'Siatka płac'!$B$6:$E$17,4,FALSE)-VLOOKUP(E81,'Siatka płac'!$B$6:$E$17,3,FALSE))),\"-\")","v":0.3},"II",{"$f":"IF(G81=\"poniżej min.\",((VLOOKUP(E81,'Siatka płac'!$B$6:$D$17,3,FALSE)-C81)*(13-'Zestawienie stanowisk'!$H$1)),\"-\")","v":"-"}]
[1,"Magazynier",2600,"Pracownik 78",{"$f":"IFERROR((VLOOKUP(B82,'Zestawienie stanowisk'!$B$5:$E$65,4,FALSE)),\"-\")","v":1},{"$f":"IFERROR(((C82-(VLOOKUP(E82,'Siatka płac'!$B$6:$E$17,3,FALSE)))/(VLOOKUP(E82,'Siatka płac'!$B$6:$E$17,4,FALSE)-VLOOKUP(E82,'Siatka płac'!$B$6:$E$17,3,FALSE))),\"-\")","v":0.3},"II",{"$f":"IF(G82=\"poniżej min.\",((VLOOKUP(E82,'Siatka płac'!$B$6:$D$17,3,FALSE)-C82)*(13-'Zestawienie stanowisk'!$H$1)),\"-\")","v":"-"}]
[1,"Magazynier",2600,"Pracownik 79",{"$f":"IFERROR((VLOOKUP(B83,'Zestawienie stanowisk'!$B$5:$E$65,4,FALSE)),\"-\")","v":1},{"$f":"IFERROR(((C83-(VLOOKUP(E83,'Siatka płac'!$B$6:$E$17,3,FALSE)))/(VLOOKUP(E83,'Siatka płac'!$B$6:$E$17,4,FALSE)-VLOOKUP(E83,'Siatka płac'!$B$6:$E$17,3,FALSE))),\"-\")","v":0.3},"II",{"$f":"IF(G83=\"poniżej min.\",((VLOOKUP(E83,'Siatka płac'!$B$6:$D$17,3,FALSE)-C83)*(13-'Zestawienie stanowisk'!$H$1)),\"-\")","v":"-"}]
[1,"Magazynier",2600,"Pracownik 80",{"$f":"IFERROR((VLOOKUP(B84,'Zestawienie stanowisk'!$B$5:$E$65,4,FALSE)),\"-\")","v":1},{"$f":"IFERROR(((C84-(VLOOKUP(E84,'Siatka płac'!$B$6:$E$17,3,FALSE)))/(VLOOKUP(E84,'Siatka płac'!$B$6:$E$17,4,FALSE)-VLOOKUP(E84,'Siatka płac'!$B$6:$E$17,3,FALSE))),\"-\")","v":0.3},"II",{"$f":"IF(G84=\"poniżej min.\",((VLOOKUP(E84,'Siatka płac'!$B$6:$D$17,3,FALSE)-C84)*(13-'Zestawienie stanowisk'!$H$1)),\"-\")","v":"-"}]
[1,"Magazynier",2600,"Pracownik 81",{"$f":"IFERROR((VLOOKUP(B85,'Zestawienie stanowisk'!$B$5:$E$65,4,FALSE)),\"-\")","v":1},{"$f":"IFERROR(((C85-(VLOOKUP(E85,'Siatka płac'!$B$6:$E$17,3,FALSE)))/(VLOOKUP(E85,'Siatka płac'!$B$6:$E$17,4,FALSE)-VLOOKUP(E85,'Siatka płac'!$B$6:$E$17,3,FALSE))),\"-\")","v":0.3},"II",{"$f":"IF(G85=\"poniżej min.\",((VLOOKUP(E85,'Siatka płac'!$B$6:$D$17,3,FALSE)-C85)*(13-'Zestawienie stanowisk'!$H$1)),\"-\")","v":"-"}]
[1,"Magazynier",2600,"Pracownik 82",{"$f":"IFERROR((VLOOKUP(B86,'Zestawienie stanowisk'!$B$5:$E$65,4,FALSE)),\"-\")","v":1},{"$f":"IFERROR(((C86-(VLOOKUP(E86,'Siatka płac'!$B$6:$E$17,3,FALSE)))/(VLOOKUP(E86,'Siatka płac'!$B$6:$E$17,4,FALSE)-VLOOKUP(E86,'Siatka płac'!$B$6:$E$17,3,FALSE))),\"-\")","v":0.3},"II",{"$f":"IF(G86=\"poniżej min.\",((VLOOKUP(E86,'Siatka płac'!$B$6:$D$17,3,FALSE)-C86)*(13-'Zestawienie stanowisk'!$H$1)),\"-\")","v":"-"}]
[1,"Magazynier",2600,"Pracownik 83",{"$f":"IFERROR((VLOOKUP(B87,'Zestawienie stanowisk'!$B$5:$E$65,4,FALSE)),\"-\")","v":1},{"$f":"IFERROR(((C87-(VLOOKUP(E87,'Siatka płac'!$B$6:$E$17,3,FALSE)))/(VLOOKUP(E87,'Siatka płac'!$B$6:$E$17,4,FALSE)-VLOOKUP(E87,'Siatka płac'!$B$6:$E$17,3,FALSE))),\"-\")","v":0.3},"II",{"$f":"IF(G87=\"poniżej min.\",((VLOOKUP(E87,'Siatka płac'!$B$6:$D$17,3,FALSE)-C87)*(13-'Zestawienie stanowisk'!$H$1)),\"-\")","v":"-"}]
[1,"Magazynier",2600,"Pracownik 84",{"$f":"IFERROR((VLOOKUP(B88,'Zestawienie stanowisk'!$B$5:$E$65,4,FALSE)),\"-\")","v":1},{"$f":"IFERROR(((C88-(VLOOKUP(E88,'Siatka płac'!$B$6:$E$17,3,FALSE)))/(VLOOKUP(E88,'Siatka płac'!$B$6:$E$17,4,FALSE)-VLOOKUP(E88,'Siatka płac'!$B$6:$E$17,3,FALSE))),\"-\")","v":0.3},"II",{"$f":"IF(G88=\"poniżej min.\",((VLOOKUP(E88,'Siatka płac'!$B$6:$D$17,3,FALSE)-C88)*(13-'Zestawienie stanowisk'!$H$1)),\"-\")","v":"-"}]
[1,"Magazynier",2600,"Pracownik 85",{"$f":"IFERROR((VLOOKUP(B89,'Zestawienie stanowisk'!$B$5:$E$65,4,FALSE)),\"-\")","v":1},{"$f":"IFERROR(((C89-(VLOOKUP(E89,'Siatka płac'!$B$6:$E$17,3,FALSE)))/(VLOOKUP(E89,'Siatka płac'!$B$6:$E$17,4,FALSE)-VLOOKUP(E89,'Siatka płac'!$B$6:$E$17,3,FALSE))),\"-\")","v":0.3},"II",{"$f":"IF(G89=\"poniżej min.\",((VLOOKUP(E89,'Siatka płac'!$B$6:$D$17,3,FALSE)-C89)*(13-'Zestawienie stanowisk'!$H$1)),\"-\")","v":"-"}]
[1,"Magazynier",2600,"Pracownik 86",{"$f":"IFERROR((VLOOKUP(B90,'Zestawienie stanowisk'!$B$5:$E$65,4,FALSE)),\"-\")","v":1},{"$f":"IFERROR(((C90-(VLOOKUP(E90,'Siatka płac'!$B$6:$E$17,3,FALSE)))/(VLOOKUP(E90,'Siatka płac'!$B$6:$E$17,4,FALSE)-VLOOKUP(E90,'Siatka płac'!$B$6:$E$17,3,FALSE))),\"-\")","v":0.3},"II",{"$f":"IF(G90=\"poniżej min.\",((VLOOKUP(E90,'Siatka płac'!$B$6:$D$17,3,FALSE)-C90)*(13-'Zestawienie stanowisk'!$H$1)),\"-\")","v":"-"}]
[1,"Magazynier",3000,"Pracownik 87",{"$f":"IFERROR((VLOOKUP(B91,'Zestawienie stanowisk'!$B$5:$E$65,4,FALSE)),\"-\")","v":1},{"$f":"IFERROR(((C91-(VLOOKUP(E91,'Siatka płac'!$B$6:$E$17,3,FALSE)))/(VLOOKUP(E91,'Siatka płac'!$B$6:$E$17,4,FALSE)-VLOOKUP(E91,'Siatka płac'!$B$6:$E$17,3,FALSE))),\"-\")","v":0.5},"II",{"$f":"IF(G91=\"poniżej min.\",((VLOOKUP(E91,'Siatka płac'!$B$6:$D$17,3,FALSE)-C91)*(13-'Zestawienie stanowisk'!$H$1)),\"-\")","v":"-"}]
[1,"Magazynier",3000,"Pracownik 88",{"$f":"IFERROR((VLOOKUP(B92,'Zestawienie stanowisk'!$B$5:$E$65,4,FALSE)),\"-\")","v":1},{"$f":"IFERROR(((C92-(VLOOKUP(E92,'Siatka płac'!$B$6:$E$17,3,FALSE)))/(VLOOKUP(E92,'Siatka płac'!$B$6:$E$17,4,FALSE)-VLOOKUP(E92,'Siatka płac'!$B$6:$E$17,3,FALSE))),\"-\")","v":0.5},"II",{"$f":"IF(G92=\"poniżej min.\",((VLOOKUP(E92,'Siatka płac'!$B$6:$D$17,3,FALSE)-C92)*(13-'Zestawienie stanowisk'!$H$1)),\"-\")","v":"-"}]
[1,"Magazynier",3000,"Pracownik 89",{"$f":"IFERROR((VLOOKUP(B93,'Zestawienie stanowisk'!$B$5:$E$65,4,FALSE)),\"-\")","v":1},{"$f":"IFERROR(((C93-(VLOOKUP(E93,'Siatka płac'!$B$6:$E$17,3,FALSE)))/(VLOOKUP(E93,'Siatka płac'!$B$6:$E$17,4,FALSE)-VLOOKUP(E93,'Siatka płac'!$B$6:$E$17,3,FALSE))),\"-\")","v":0.5},"II",{"$f":"IF(G93=\"poniżej min.\",((VLOOKUP(E93,'Siatka płac'!$B$6:$D$17,3,FALSE)-C93)*(13-'Zestawienie stanowisk'!$H$1)),\"-\")","v":"-"}]
[1,"Magazynier",3000,"Pracownik 90",{"$f":"IFERROR((VLOOKUP(B94,'Zestawienie stanowisk'!$B$5:$E$65,4,FALSE)),\"-\")","v":1},{"$f":"IFERROR(((C94-(VLOOKUP(E94,'Siatka płac'!$B$6:$E$17,3,FALSE)))/(VLOOKUP(E94,'Siatka płac'!$B$6:$E$17,4,FALSE)-VLOOKUP(E94,'Siatka płac'!$B$6:$E$17,3,FALSE))),\"-\")","v":0.5},"II",{"$f":"IF(G94=\"poniżej min.\",((VLOOKUP(E94,'Siatka płac'!$B$6:$D$17,3,FALSE)-C94)*(13-'Zestawienie stanowisk'!$H$1)),\"-\")","v":"-"}]
[1,"Magazynier",3000,"Pracownik 91",{"$f":"IFERROR((VLOOKUP(B95,'Zestawienie stanowisk'!$B$5:$E$65,4,FALSE)),\"-\")","v":1},{"$f":"IFERROR(((C95-(VLOOKUP(E95,'Siatka płac'!$B$6:$E$17,3,FALSE)))/(VLOOKUP(E95,'Siatka płac'!$B$6:$E$17,4,FALSE)-VLOOKUP(E95,'Siatka płac'!$B$6:$E$17,3,FALSE))),\"-\")","v":0.5},"II",{"$f":"IF(G95=\"poniżej min.\",((VLOOKUP(E95,'Siatka płac'!$B$6:$D$17,3,FALSE)-C95)*(13-'Zestawienie stanowisk'!$H$1)),\"-\")","v":"-"}]
[1,"Magazynier",3000,"Pracownik 92",{"$f":"IFERROR((VLOOKUP(B96,'Zestawienie stanowisk'!$B$5:$E$65,4,FALSE)),\"-\")","v":1},{"$f":"IFERROR(((C96-(VLOOKUP(E96,'Siatka płac'!$B$6:$E$17,3,FALSE)))/(VLOOKUP(E96,'Siatka płac'!$B$6:$E$17,4,FALSE)-VLOOKUP(E96,'Siatka płac'!$B$6:$E$17,3,FALSE))),\"-\")","v":0.5},"II",{"$f":"IF(G96=\"poniżej min.\",((VLOOKUP(E96,'Siatka płac'!$B$6:$D$17,3,FALSE)-C96)*(13-'Zestawienie stanowisk'!$H$1)),\"-\")","v":"-"}]
[1,"Magazynier",3000,"Pracownik 93",{"$f":"IFERROR((VLOOKUP(B97,'Zestawienie stanowisk'!$B$5:$E$65,4,FALSE)),\"-\")","v":1},{"$f":"IFERROR(((C97-(VLOOKUP(E97,'Siatka płac'!$B$6:$E$17,3,FALSE)))/(VLOOKUP(E97,'Siatka płac'!$B$6:$E$17,4,FALSE)-VLOOKUP(E97,'Siatka płac'!$B$6:$E$17,3,FALSE))),\"-\")","v":0.5},"II",{"$f":"IF(G97=\"poniżej min.\",((VLOOKUP(E97,'Siatka płac'!$B$6:$D$17,3,FALSE)-C97)*(13-'Zestawienie stanowisk'!$H$1)),\"-\")","v":"-"}]
[1,"Magazynier",3000,"Pracownik 94",{"$f":"IFERROR((VLOOKUP(B98,'Zestawienie stanowisk'!$B$5:$E$65,4,FALSE)),\"-\")","v":1},{"$f":"IFERROR(((C98-(VLOOKUP(E98,'Siatka płac'!$B$6:$E$17,3,FALSE)))/(VLOOKUP(E98,'Siatka płac'!$B$6:$E$17,4,FALSE)-VLOOKUP(E98,'Siatka płac'!$B$6:$E$17,3,FALSE))),\"-\")","v":0.5},"II",{"$f":"IF(G98=\"poniżej min.\",((VLOOKUP(E98,'Siatka płac'!$B$6:$D$17,3,FALSE)-C98)*(13-'Zestawienie stanowisk'!$H$1)),\"-\")","v":"-"}]
[1,"Magazynier",3000,"Pracownik 95",{"$f":"IFERROR((VLOOKUP(B99,'Zestawienie stanowisk'!$B$5:$E$65,4,FALSE)),\"-\")","v":1},{"$f":"IFERROR(((C99-(VLOOKUP(E99,'Siatka płac'!$B$6:$E$17,3,FALSE)))/(VLOOKUP(E99,'Siatka płac'!$B$6:$E$17,4,FALSE)-VLOOKUP(E99,'Siatka płac'!$B$6:$E$17,3,FALSE))),\"-\")","v":0.5},"II",{"$f":"IF(G99=\"poniżej min.\",((VLOOKUP(E99,'Siatka płac'!$B$6:$D$17,3,FALSE)-C99)*(13-'Zestawienie stanowisk'!$H$1)),\"-\")","v":"-"}]
[1,"Magazynier",3000,"Pracownik 96",{"$f":"IFERROR((VLOOKUP(B100,'Zestawienie stanowisk'!$B$5:$E$65,4,FALSE)),\"-\")","v":1},{"$f":"IFERROR(((C100-(VLOOKUP(E100,'Siatka płac'!$B$6:$E$17,3,FALSE)))/(VLOOKUP(E100,'Siatka płac'!$B$6:$E$17,4,FALSE)-VLOOKUP(E100,'Siatka płac'!$B$6:$E$17,3,FALSE))),\"-\")","v":0.5},"II",{"$f":"IF(G100=\"poniżej min.\",((VLOOKUP(E100,'Siatka płac'!$B$6:$D$17,3,FALSE)-C100)*(13-'Zestawienie stanowisk'!$H$1)),\"-\")","v":"-"}]
[1,"Magazynier",3000,"Pracownik 97",{"$f":"IFERROR((VLOOKUP(B101,'Zestawienie stanowisk'!$B$5:$E$65,4,FALSE)),\"-\")","v":1},{"$f":"IFERROR(((C101-(VLOOKUP(E101,'Siatka płac'!$B$6:$E$17,3,FALSE)))/(VLOOKUP(E101,'Siatka płac'!$B$6:$E$17,4,FALSE)-VLOOKUP(E101,'Siatka płac'!$B$6:$E$17,3,FALSE))),\"-\")","v":0.5},"II",{"$f":"IF(G101=\"poniżej min.\",((VLOOKUP(E101,'Siatka płac'!$B$6:$D$17,3,FALSE)-C101)*(13-'Zestawienie stanowisk'!$H$1)),\"-\")","v":"-"}]
[1,"Magazynier",3000,"Pracownik 98",{"$f":"IFERROR((VLOOKUP(B102,'Zestawienie stanowisk'!$B$5:$E$65,4,FALSE)),\"-\")","v":1},{"$f":"IFERROR(((C102-(VLOOKUP(E102,'Siatka płac'!$B$6:$E$17,3,FALSE)))/(VLOOKUP(E102,'Siatka płac'!$B$6:$E$17,4,FALSE)-VLOOKUP(E102,'Siatka płac'!$B$6:$E$17,3,FALSE))),\"-\")","v":0.5},"II",{"$f":"IF(G102=\"poniżej min.\",((VLOOKUP(E102,'Siatka płac'!$B$6:$D$17,3,FALSE)-C102)*(13-'Zestawienie stanowisk'!$H$1)),\"-\")","v":"-"}]
[1,"Magazynier",3000,"Pracownik 99",{"$f":"IFERROR((VLOOKUP(B103,'Zestawienie stanowisk'!$B$5:$E$65,4,FALSE)),\"-\")","v":1},{"$f":"IFERROR(((C103-(VLOOKUP(E103,'Siatka płac'!$B$6:$E$17,3,FALSE)))/(VLOOKUP(E103,'Siatka płac'!$B$6:$E$17,4,FALSE)-VLOOKUP(E103,'Siatka płac'!$B$6:$E$17,3,FALSE))),\"-\")","v":0.5},"II",{"$f":"IF(G103=\"poniżej min.\",((VLOOKUP(E103,'Siatka płac'!$B$6:$D$17,3,FALSE)-C103)*(13-'Zestawienie stanowisk'!$H$1)),\"-\")","v":"-"}]
[1,"Magazynier",3700,"Pracownik 100",{"$f":"IFERROR((VLOOKUP(B104,'Zestawienie stanowisk'!$B$5:$E$65,4,FALSE)),\"-\")","v":1},{"$f":"IFERROR(((C104-(VLOOKUP(E104,'Siatka płac'!$B$6:$E$17,3,FALSE)))/(VLOOKUP(E104,'Siatka płac'!$B$6:$E$17,4,FALSE)-VLOOKUP(E104,'Siatka płac'!$B$6:$E$17,3,FALSE))),\"-\")","v":0.85},"IV",{"$f":"IF(G104=\"poniżej min.\",((VLOOKUP(E104,'Siatka płac'!$B$6:$D$17,3,FALSE)-C104)*(13-'Zestawienie stanowisk'!$H$1)),\"-\")","v":"-"}]
[1,"Magazynier",3700,"Pracownik 101",{"$f":"IFERROR((VLOOKUP(B105,'Zestawienie stanowisk'!$B$5:$E$65,4,FALSE)),\"-\")","v":1},{"$f":"IFERROR(((C105-(VLOOKUP(E105,'Siatka płac'!$B$6:$E$17,3,FALSE)))/(VLOOKUP(E105,'Siatka płac'!$B$6:$E$17,4,FALSE)-VLOOKUP(E105,'Siatka płac'!$B$6:$E$17,3,FALSE))),\"-\")","v":0.85},"IV",{"$f":"IF(G105=\"poniżej min.\",((VLOOKUP(E105,'Siatka płac'!$B$6:$D$17,3,FALSE)-C105)*(13-'Zestawienie stanowisk'!$H$1)),\"-\")","v":"-"}]
[1,"Magazynier",3700,"Pracownik 102",{"$f":"IFERROR((VLOOKUP(B106,'Zestawienie stanowisk'!$B$5:$E$65,4,FALSE)),\"-\")","v":1},{"$f":"IFERROR(((C106-(VLOOKUP(E106,'Siatka płac'!$B$6:$E$17,3,FALSE)))/(VLOOKUP(E106,'Siatka płac'!$B$6:$E$17,4,FALSE)-VLOOKUP(E106,'Siatka płac'!$B$6:$E$17,3,FALSE))),\"-\")","v":0.85},"IV",{"$f":"IF(G106=\"poniżej min.\",((VLOOKUP(E106,'Siatka płac'!$B$6:$D$17,3,FALSE)-C106)*(13-'Zestawienie stanowisk'!$H$1)),\"-\")","v":"-"}]
[1,"Magazynier",3700,"Pracownik 103",{"$f":"IFERROR((VLOOKUP(B107,'Zestawienie stanowisk'!$B$5:$E$65,4,FALSE)),\"-\")","v":1},{"$f":"IFERROR(((C107-(VLOOKUP(E107,'Siatka płac'!$B$6:$E$17,3,FALSE)))/(VLOOKUP(E107,'Siatka płac'!$B$6:$E$17,4,FALSE)-VLOOKUP(E107,'Siatka płac'!$B$6:$E$17,3,FALSE))),\"-\")","v":0.85},"IV",{"$f":"IF(G107=\"poniżej min.\",((VLOOKUP(E107,'Siatka płac'!$B$6:$D$17,3,FALSE)-C107)*(13-'Zestawienie stanowisk'!$H$1)),\"-\")","v":"-"}]
[1,"Magazynier",3700,"Pracownik 104",{"$f":"IFERROR((VLOOKUP(B108,'Zestawienie stanowisk'!$B$5:$E$65,4,FALSE)),\"-\")","v":1},{"$f":"IFERROR(((C108-(VLOOKUP(E108,'Siatka płac'!$B$6:$E$17,3,FALSE)))/(VLOOKUP(E108,'Siatka płac'!$B$6:$E$17,4,FALSE)-VLOOKUP(E108,'Siatka płac'!$B$6:$E$17,3,FALSE))),\"-\")","v":0.85},"IV",{"$f":"IF(G108=\"poniżej min.\",((VLOOKUP(E108,'Siatka płac'!$B$6:$D$17,3,FALSE)-C108)*(13-'Zestawienie stanowisk'!$H$1)),\"-\")","v":"-"}]
[1,"Magazynier",3700,"Pracownik 105",{"$f":"IFERROR((VLOOKUP(B109,'Zestawienie stanowisk'!$B$5:$E$65,4,FALSE)),\"-\")","v":1},{"$f":"IFERROR(((C109-(VLOOKUP(E109,'Siatka płac'!$B$6:$E$17,3,FALSE)))/(VLOOKUP(E109,'Siatka płac'!$B$6:$E$17,4,FALSE)-VLOOKUP(E109,'Siatka płac'!$B$6:$E$17,3,FALSE))),\"-\")","v":0.85},"IV",{"$f":"IF(G109=\"poniżej min.\",((VLOOKUP(E109,'Siatka płac'!$B$6:$D$17,3,FALSE)-C109)*(13-'Zestawienie stanowisk'!$H$1)),\"-\")","v":"-"}]
[1,"Magazynier",3700,"Pracownik 106",{"$f":"IFERROR((VLOOKUP(B110,'Zestawienie stanowisk'!$B$5:$E$65,4,FALSE)),\"-\")","v":1},{"$f":"IFERROR(((C110-(VLOOKUP(E110,'Siatka płac'!$B$6:$E$17,3,FALSE)))/(VLOOKUP(E110,'Siatka płac'!$B$6:$E$17,4,FALSE)-VLOOKUP(E110,'Siatka płac'!$B$6:$E$17,3,FALSE))),\"-\")","v":0.85},"IV",{"$f":"IF(G110=\"poniżej min.\",((VLOOKUP(E110,'Siatka płac'!$B$6:$D$17,3,FALSE)-C110)*(13-'Zestawienie stanowisk'!$H$1)),\"-\")","v":"-"}]
[1,"Magazynier",3700,"Pracownik 107",{"$f":"IFERROR((VLOOKUP(B111,'Zestawienie stanowisk'!$B$5:$E$65,4,FALSE)),\"-\")","v":1},{"$f":"IFERROR(((C111-(VLOOKUP(E111,'Siatka płac'!$B$6:$E$17,3,FALSE)))/(VLOOKUP(E111,'Siatka płac'!$B$6:$E$17,4,FALSE)-VLOOKUP(E111,'Siatka płac'!$B$6:$E$17,3,FALSE))),\"-\")","v":0.85},"IV",{"$f":"IF(G111=\"poniżej min.\",((VLOOKUP(E111,'Siatka płac'!$B$6:$D$17,3,FALSE)-C111)*(13-'Zestawienie stanowisk'!$H$1)),\"-\")","v":"-"}]
[1,"Magazynier",3700,"Pracownik 108",{"$f":"IFERROR((VLOOKUP(B112,'Zestawienie stanowisk'!$B$5:$E$65,4,FALSE)),\"-\")","v":1},{"$f":"IFERROR(((C112-(VLOOKUP(E112,'Siatka płac'!$B$6:$E$17,3,FALSE)))/(VLOOKUP(E112,'Siatka płac'!$B$6:$E$17,4,FALSE)-VLOOKUP(E112,'Siatka płac'!$B$6:$E$17,3,FALSE))),\"-\")","v":0.85},"IV",{"$f":"IF(G112=\"poniżej min.\",((VLOOKUP(E112,'Siatka płac'!$B$6:$D$17,3,FALSE)-C112)*(13-'Zestawienie stanowisk'!$H$1)),\"-\")","v":"-"}]
[1,"Magazynier",3400,"Pracownik 109",{"$f":"IFERROR((VLOOKUP(B113,'Zestawienie stanowisk'!$B$5:$E$65,4,FALSE)),\"-\")","v":1},{"$f":"IFERROR(((C113-(VLOOKUP(E113,'Siatka płac'!$B$6:$E$17,3,FALSE)))/(VLOOKUP(E113,'Siatka płac'!$B$6:$E$17,4,FALSE)-VLOOKUP(E113,'Siatka płac'!$B$6:$E$17,3,FALSE))),\"-\")","v":0.7},"III",{"$f":"IF(G113=\"poniżej min.\",((VLOOKUP(E113,'Siatka płac'!$B$6:$D$17,3,FALSE)-C113)*(13-'Zestawienie stanowisk'!$H$1)),\"-\")","v":"-"}]
[1,"Magazynier",3400,"Pracownik 110",{"$f":"IFERROR((VLOOKUP(B114,'Zestawienie stanowisk'!$B$5:$E$65,4,FALSE)),\"-\")","v":1},{"$f":"IFERROR(((C114-(VLOOKUP(E114,'Siatka płac'!$B$6:$E$17,3,FALSE)))/(VLOOKUP(E114,'Siatka płac'!$B$6:$E$17,4,FALSE)-VLOOKUP(E114,'Siatka płac'!$B$6:$E$17,3,FALSE))),\"-\")","v":0.7},"III",{"$f":"IF(G114=\"poniżej min.\",((VLOOKUP(E114,'Siatka płac'!$B$6:$D$17,3,FALSE)-C114)*(13-'Zestawienie stanowisk'!$H$1)),\"-\")","v":"-"}]
[1,"Magazynier",3400,"Pracownik 111",{"$f":"IFERROR((VLOOKUP(B115,'Zestawienie stanowisk'!$B$5:$E$65,4,FALSE)),\"-\")","v":1},{"$f":"IFERROR(((C115-(VLOOKUP(E115,'Siatka płac'!$B$6:$E$17,3,FALSE)))/(VLOOKUP(E115,'Siatka płac'!$B$6:$E$17,4,FALSE)-VLOOKUP(E115,'Siatka płac'!$B$6:$E$17,3,FALSE))),\"-\")","v":0.7},"III",{"$f":"IF(G115=\"poniżej min.\",((VLOOKUP(E115,'Siatka płac'!$B$6:$D$17,3,FALSE)-C115)*(13-'Zestawienie stanowisk'!$H$1)),\"-\")","v":"-"}]
[1,"Magazynier",3400,"Pracownik 112",{"$f":"IFERROR((VLOOKUP(B116,'Zestawienie stanowisk'!$B$5:$E$65,4,FALSE)),\"-\")","v":1},{"$f":"IFERROR(((C116-(VLOOKUP(E116,'Siatka płac'!$B$6:$E$17,3,FALSE)))/(VLOOKUP(E116,'Siatka płac'!$B$6:$E$17,4,FALSE)-VLOOKUP(E116,'Siatka płac'!$B$6:$E$17,3,FALSE))),\"-\")","v":0.7},"III",{"$f":"IF(G116=\"poniżej min.\",((VLOOKUP(E116,'Siatka płac'!$B$6:$D$17,3,FALSE)-C116)*(13-'Zestawienie stanowisk'!$H$1)),\"-\")","v":"-"}]
[1,"Magazynier",3400,"Pracownik 113",{"$f":"IFERROR((VLOOKUP(B117,'Zestawienie stanowisk'!$B$5:$E$65,4,FALSE)),\"-\")","v":1},{"$f":"IFERROR(((C117-(VLOOKUP(E117,'Siatka płac'!$B$6:$E$17,3,FALSE)))/(VLOOKUP(E117,'Siatka płac'!$B$6:$E$17,4,FALSE)-VLOOKUP(E117,'Siatka płac'!$B$6:$E$17,3,FALSE))),\"-\")","v":0.7},"III",{"$f":"IF(G117=\"poniżej min.\",((VLOOKUP(E117,'Siatka płac'!$B$6:$D$17,3,FALSE)-C117)*(13-'Zestawienie stanowisk'!$H$1)),\"-\")","v":"-"}]
[1,"Magazynier",3400,"Pracownik 114",{"$f":"IFERROR((VLOOKUP(B118,'Zestawienie stanowisk'!$B$5:$E$65,4,FALSE)),\"-\")","v":1},{"$f":"IFERROR(((C118-(VLOOKUP(E118,'Siatka płac'!$B$6:$E$17,3,FALSE)))/(VLOOKUP(E118,'Siatka płac'!$B$6:$E$17,4,FALSE)-VLOOKUP(E118,'Siatka płac'!$B$6:$E$17,3,FALSE))),\"-\")","v":0.7},"III",{"$f":"IF(G118=\"poniżej min.\",((VLOOKUP(E118,'Siatka płac'!$B$6:$D$17,3,FALSE)-C118)*(13-'Zestawienie stanowisk'!$H$1)),\"-\")","v":"-"}]
[1,"Magazynier",3400,"Pracownik 115",{"$f":"IFERROR((VLOOKUP(B119,'Zestawienie stanowisk'!$B$5:$E$65,4,FALSE)),\"-\")","v":1},{"$f":"IFERROR(((C119-(VLOOKUP(E119,'Siatka płac'!$B$6:$E$17,3,FALSE)))/(VLOOKUP(E119,'Siatka płac'!$B$6:$E$17,4,FALSE)-VLOOKUP(E119,'Siatka płac'!$B$6:$E$17,3,FALSE))),\"-\")","v":0.7},"III",{"$f":"IF(G119=\"poniżej min.\",((VLOOKUP(E119,'Siatka płac'!$B$6:$D$17,3,FALSE)-C119)*(13-'Zestawienie stanowisk'!$H$1)),\"-\")","v":"-"}]
[1,"Magazynier",3400,"Pracownik 116",{"$f":"IFERROR((VLOOKUP(B120,'Zestawienie stanowisk'!$B$5:$E$65,4,FALSE)),\"-\")","v":1},{"$f":"IFERROR(((C120-(VLOOKUP(E120,'Siatka płac'!$B$6:$E$17,3,FALSE)))/(VLOOKUP(E120,'Siatka płac'!$B$6:$E$17,4,FALSE)-VLOOKUP(E120,'Siatka płac'!$B$6:$E$17,3,FALSE))),\"-\")","v":0.7},"III",{"$f":"IF(G120=\"poniżej min.\",((VLOOKUP(E120,'Siatka płac'!$B$6:$D$17,3,FALSE)-C120)*(13-'Zestawienie stanowisk'!$H$1)),\"-\")","v":"-"}]
[1,"Magazynier",3400,"Pracownik 117",{"$f":"IFERROR((VLOOKUP(B121,'Zestawienie stanowisk'!$B$5:$E$65,4,FALSE)),\"-\")","v":1},{"$f":"IFERROR(((C121-(VLOOKUP(E121,'Siatka płac'!$B$6:$E$17,3,FALSE)))/(VLOOKUP(E121,'Siatka płac'!$B$6:$E$17,4,FALSE)-VLOOKUP(E121,'Siatka płac'!$B$6:$E$17,3,FALSE))),\"-\")","v":0.7},"III",{"$f":"IF(G121=\"poniżej min.\",((VLOOKUP(E121,'Siatka płac'!$B$6:$D$17,3,FALSE)-C121)*(13-'Zestawienie stanowisk'!$H$1)),\"-\")","v":"-"}]
[1,"Magazynier",3400,"Pracownik 118",{"$f":"IFERROR((VLOOKUP(B122,'Zestawienie stanowisk'!$B$5:$E$65,4,FALSE)),\"-\")","v":1},{"$f":"IFERROR(((C122-(VLOOKUP(E122,'Siatka płac'!$B$6:$E$17,3,FALSE)))/(VLOOKUP(E122,'Siatka płac'!$B$6:$E$17,4,FALSE)-VLOOKUP(E122,'Siatka płac'!$B$6:$E$17,3,FALSE))),\"-\")","v":0.7},"III",{"$f":"IF(G122=\"poniżej min.\",((VLOOKUP(E122,'Siatka płac'!$B$6:$D$17,3,FALSE)-C122)*(13-'Zestawienie stanowisk'!$H$1)),\"-\")","v":"-"}]
[1,"Magazynier",3400,"Pracownik 119",{"$f":"IFERROR((VLOOKUP(B123,'Zestawienie stanowisk'!$B$5:$E$65,4,FALSE)),\"-\")","v":1},{"$f":"IFERROR(((C123-(VLOOKUP(E123,'Siatka płac'!$B$6:$E$17,3,FALSE)))/(VLOOKUP(E123,'Siatka płac'!$B$6:$E$17,4,FALSE)-VLOOKUP(E123,'Siatka płac'!$B$6:$E$17,3,FALSE))),\"-\")","v":0.7},"III",{"$f":"IF(G123=\"poniżej min.\",((VLOOKUP(E123,'Siatka płac'!$B$6:$D$17,3,FALSE)-C123)*(13-'Zestawienie stanowisk'!$H$1)),\"-\")","v":"-"}]
[1,"Magazynier",4000,"Pracownik 120",{"$f":"IFERROR((VLOOKUP(B124,'Zestawienie stanowisk'!$B$5:$E$65,4,FALSE)),\"-\")","v":1},{"$f":"IFERROR(((C124-(VLOOKUP(E124,'Siatka płac'!$B$6:$E$17,3,FALSE)))/(VLOOKUP(E124,'Siatka płac'!$B$6:$E$17,4,FALSE)-VLOOKUP(E124,'Siatka płac'!$B$6:$E$17,3,FALSE))),\"-\")","v":1},"IV",{"$f":"IF(G124=\"poniżej min.\",((VLOOKUP(E124,'Siatka płac'!$B$6:$D$17,3,FALSE)-C124)*(13-'Zestawienie stanowisk'!$H$1)),\"-\")","v":"-"}]
[1,"Magazynier",4000,"Pracownik 121",{"$f":"IFERROR((VLOOKUP(B125,'Zestawienie stanowisk'!$B$5:$E$65,4,FALSE)),\"-\")","v":1},{"$f":"IFERROR(((C125-(VLOOKUP(E125,'Siatka płac'!$B$6:$E$17,3,FALSE)))/(VLOOKUP(E125,'Siatka płac'!$B$6:$E$17,4,FALSE)-VLOOKUP(E125,'Siatka płac'!$B$6:$E$17,3,FALSE))),\"-\")","v":1},"IV",{"$f":"IF(G125=\"poniżej min.\",((VLOOKUP(E125,'Siatka płac'!$B$6:$D$17,3,FALSE)-C125)*(13-'Zestawienie stanowisk'!$H$1)),\"-\")","v":"-"}]
[1,"Magazynier",4000,"Pracownik 122",{"$f":"IFERROR((VLOOKUP(B126,'Zestawienie stanowisk'!$B$5:$E$65,4,FALSE)),\"-\")","v":1},{"$f":"IFERROR(((C126-(VLOOKUP(E126,'Siatka płac'!$B$6:$E$17,3,FALSE)))/(VLOOKUP(E126,'Siatka płac'!$B$6:$E$17,4,FALSE)-VLOOKUP(E126,'Siatka płac'!$B$6:$E$17,3,FALSE))),\"-\")","v":1},"IV",{"$f":"IF(G126=\"poniżej min.\",((VLOOKUP(E126,'Siatka płac'!$B$6:$D$17,3,FALSE)-C126)*(13-'Zestawienie stanowisk'!$H$1)),\"-\")","v":"-"}]
[1,"Magazynier",4000,"Pracownik 123",{"$f":"IFERROR((VLOOKUP(B127,'Zestawienie stanowisk'!$B$5:$E$65,4,FALSE)),\"-\")","v":1},{"$f":"IFERROR(((C127-(VLOOKUP(E127,'Siatka płac'!$B$6:$E$17,3,FALSE)))/(VLOOKUP(E127,'Siatka płac'!$B$6:$E$17,4,FALSE)-VLOOKUP(E127,'Siatka płac'!$B$6:$E$17,3,FALSE))),\"-\")","v":1},"IV",{"$f":"IF(G127=\"poniżej min.\",((VLOOKUP(E127,'Siatka płac'!$B$6:$D$17,3,FALSE)-C127)*(13-'Zestawienie stanowisk'!$H$1)),\"-\")","v":"-"}]
[1,"Magazynier",4000,"Pracownik 124",{"$f":"IFERROR((VLOOKUP(B128,'Zestawienie stanowisk'!$B$5:$E$65,4,FALSE)),\"-\")","v":1},{"$f":"IFERROR(((C128-(VLOOKUP(E128,'Siatka płac'!$B$6:$E$17,3,FALSE)))/(VLOOKUP(E128,'Siatka płac'!$B$6:$E$17,4,FALSE)-VLOOKUP(E128,'Siatka płac'!$B$6:$E$17,3,FALSE))),\"-\")","v":1},"IV",{"$f":"IF(G128=\"poniżej min.\",((VLOOKUP(E128,'Siatka płac'!$B$6:$D$17,3,FALSE)-C128)*(13-'Zestawienie stanowisk'!$H$1)),\"-\")","v":"-"}]
[1,"Magazynier",4000,"Pracownik 125",{"$f":"IFERROR((VLOOKUP(B129,'Zestawienie stanowisk'!$B$5:$E$65,4,FALSE)),\"-\")","v":1},{"$f":"IFERROR(((C129-(VLOOKUP(E129,'Siatka płac'!$B$6:$E$17,3,FALSE)))/(VLOOKUP(E129,'Siatka płac'!$B$6:$E$17,4,FALSE)-VLOOKUP(E129,'Siatka płac'!$B$6:$E$17,3,FALSE))),\"-\")","v":1},"IV",{"$f":"IF(G129=\"poniżej min.\",((VLOOKUP(E129,'Siatka płac'!$B$6:$D$17,3,FALSE)-C129)*(13-'Zestawienie stanowisk'!$H$1)),\"-\")","v":"-"}]
[1,"Magazynier",4000,"Pracownik 126",{"$f":"IFERROR((VLOOKUP(B130,'Zestawienie stanowisk'!$B$5:$E$65,4,FALSE)),\"-\")","v":1},{"$f":"IFERROR(((C130-(VLOOKUP(E130,'Siatka płac'!$B$6:$E$17,3,FALSE)))/(VLOOKUP(E130,'Siatka płac'!$B$6:$E$17,4,FALSE)-VLOOKUP(E130,'Siatka płac'!$B$6:$E$17,3,FALSE))),\"-\")","v":1},"IV",{"$f":"IF(G130=\"poniżej min.\",((VLOOKUP(E130,'Siatka płac'!$B$6:$D$17,3,FALSE)-C130)*(13-'Zestawienie stanowisk'!$H$1)),\"-\")","v":"-"}]
[1,"Magazynier",4000,"Pracownik 127",{"$f":"IFERROR((VLOOKUP(B131,'Zestawienie stanowisk'!$B$5:$E$65,4,FALSE)),\"-\")","v":1},{"$f":"IFERROR(((C131-(VLOOKUP(E131,'Siatka płac'!$B$6:$E$17,3,FALSE)))/(VLOOKUP(E131,'Siatka płac'!$B$6:$E$17,4,FALSE)-VLOOKUP(E131,'Siatka płac'!$B$6:$E$17,3,FALSE))),\"-\")","v":1},"IV",{"$f":"IF(G131=\"poniżej min.\",((VLOOKUP(E131,'Siatka płac'!$B$6:$D$17,3,FALSE)-C131)*(13-'Zestawienie stanowisk'!$H$1)),\"-\")","v":"-"}]
[1,"Magazynier",4000,"Pracownik 128",{"$f":"IFERROR((VLOOKUP(B132,'Zestawienie stanowisk'!$B$5:$E$65,4,FALSE)),\"-\")","v":1},{"$f":"IFERROR(((C132-(VLOOKUP(E132,'Siatka płac'!$B$6:$E$17,3,FALSE)))/(VLOOKUP(E132,'Siatka płac'!$B$6:$E$17,4,FALSE)-VLOOKUP(E132,'Siatka płac'!$B$6:$E$17,3,FALSE))),\"-\")","v":1},"IV",{"$f":"IF(G132=\"poniżej min.\",((VLOOKUP(E132,'Siatka płac'!$B$6:$D$17,3,FALSE)-C132)*(13-'Zestawienie stanowisk'!$H$1)),\"-\")","v":"-"}]
[{"$f":"IF(ISBLANK(B133),0,1)","v":1},"Magazynier",4000,"Pracownik 129",{"$f":"IFERROR((VLOOKUP(B133,'Zestawienie stanowisk'!$B$5:$E$65,4,FALSE)),\"-\")","v":1},{"$f":"IFERROR(((C133-(VLOOKUP(E133,'Siatka płac'!$B$6:$E$17,3,FALSE)))/(VLOOKUP(E133,'Siatka płac'!$B$6:$E$17,4,FALSE)-VLOOKUP(E133,'Siatka płac'!$B$6:$E$17,3,FALSE))),\"-\")","v":1},{"$f":"IFERROR((INDEX($N$5:$N$10,MATCH(F133,$M$5:$M$10,-1))),\"-\")","v":"IV"},{"$f":"IF(G133=\"poniżej min.\",((VLOOKUP(E133,'Siatka płac'!$B$6:$D$17,3,FALSE)-C133)*(13-'Zestawienie stanowisk'!$H$1)),\"-\")","v":"-"}]
[1,"Magazynier",4000,"Pracownik 130",{"$f":"IFERROR((VLOOKUP(B134,'Zestawienie stanowisk'!$B$5:$E$65,4,FALSE)),\"-\")","v":1},{"$f":"IFERROR(((C134-(VLOOKUP(E134,'Siatka płac'!$B$6:$E$17,3,FALSE)))/(VLOOKUP(E134,'Siatka płac'!$B$6:$E$17,4,FALSE)-VLOOKUP(E134,'Siatka płac'!$B$6:$E$17,3,FALSE))),\"-\")","v":1},"IV",{"$f":"IF(G134=\"poniżej min.\",((VLOOKUP(E134,'Siatka płac'!$B$6:$D$17,3,FALSE)-C134)*(13-'Zestawienie stanowisk'!$H$1)),\"-\")","v":"-"}]
[1,"Magazynier",4000,"Pracownik 131",{"$f":"IFERROR((VLOOKUP(B135,'Zestawienie stanowisk'!$B$5:$E$65,4,FALSE)),\"-\")","v":1},{"$f":"IFERROR(((C135-(VLOOKUP(E135,'Siatka płac'!$B$6:$E$17,3,FALSE)))/(VLOOKUP(E135,'Siatka płac'!$B$6:$E$17,4,FALSE)-VLOOKUP(E135,'Siatka płac'!$B$6:$E$17,3,FALSE))),\"-\")","v":1},"IV",{"$f":"IF(G135=\"poniżej min.\",((VLOOKUP(E135,'Siatka płac'!$B$6:$D$17,3,FALSE)-C135)*(13-'Zestawienie stanowisk'!$H$1)),\"-\")","v":"-"}]
[1,"Magazynier",4000,"Pracownik 132",{"$f":"IFERROR((VLOOKUP(B136,'Zestawienie stanowisk'!$B$5:$E$65,4,FALSE)),\"-\")","v":1},{"$f":"IFERROR(((C136-(VLOOKUP(E136,'Siatka płac'!$B$6:$E$17,3,FALSE)))/(VLOOKUP(E136,'Siatka płac'!$B$6:$E$17,4,FALSE)-VLOOKUP(E136,'Siatka płac'!$B$6:$E$17,3,FALSE))),\"-\")","v":1},"IV",{"$f":"IF(G136=\"poniżej min.\",((VLOOKUP(E136,'Siatka płac'!$B$6:$D$17,3,FALSE)-C136)*(13-'Zestawienie stanowisk'!$H$1)),\"-\")","v":"-"}]
[1,"Magazynier",4000,"Pracownik 133",{"$f":"IFERROR((VLOOKUP(B137,'Zestawienie stanowisk'!$B$5:$E$65,4,FALSE)),\"-\")","v":1},{"$f":"IFERROR(((C137-(VLOOKUP(E137,'Siatka płac'!$B$6:$E$17,3,FALSE)))/(VLOOKUP(E137,'Siatka płac'!$B$6:$E$17,4,FALSE)-VLOOKUP(E137,'Siatka płac'!$B$6:$E$17,3,FALSE))),\"-\")","v":1},"IV",{"$f":"IF(G137=\"poniżej min.\",((VLOOKUP(E137,'Siatka płac'!$B$6:$D$17,3,FALSE)-C137)*(13-'Zestawienie stanowisk'!$H$1)),\"-\")","v":"-"}]
[1,"Magazynier",4000,"Pracownik 134",{"$f":"IFERROR((VLOOKUP(B138,'Zestawienie stanowisk'!$B$5:$E$65,4,FALSE)),\"-\")","v":1},{"$f":"IFERROR(((C138-(VLOOKUP(E138,'Siatka płac'!$B$6:$E$17,3,FALSE)))/(VLOOKUP(E138,'Siatka płac'!$B$6:$E$17,4,FALSE)-VLOOKUP(E138,'Siatka płac'!$B$6:$E$17,3,FALSE))),\"-\")","v":1},"IV",{"$f":"IF(G138=\"poniżej min.\",((VLOOKUP(E138,'Siatka płac'!$B$6:$D$17,3,FALSE)-C138)*(13-'Zestawienie stanowisk'!$H$1)),\"-\")","v":"-"}]
[1,"Magazynier",4000,"Pracownik 135",{"$f":"IFERROR((VLOOKUP(B139,'Zestawienie stanowisk'!$B$5:$E$65,4,FALSE)),\"-\")","v":1},{"$f":"IFERROR(((C139-(VLOOKUP(E139,'Siatka płac'!$B$6:$E$17,3,FALSE)))/(VLOOKUP(E139,'Siatka płac'!$B$6:$E$17,4,FALSE)-VLOOKUP(E139,'Siatka płac'!$B$6:$E$17,3,FALSE))),\"-\")","v":1},"IV",{"$f":"IF(G139=\"poniżej min.\",((VLOOKUP(E139,'Siatka płac'!$B$6:$D$17,3,FALSE)-C139)*(13-'Zestawienie stanowisk'!$H$1)),\"-\")","v":"-"}]
[1,"Magazynier",4000,"Pracownik 136",{"$f":"IFERROR((VLOOKUP(B140,'Zestawienie stanowisk'!$B$5:$E$65,4,FALSE)),\"-\")","v":1},{"$f":"IFERROR(((C140-(VLOOKUP(E140,'Siatka płac'!$B$6:$E$17,3,FALSE)))/(VLOOKUP(E140,'Siatka płac'!$B$6:$E$17,4,FALSE)-VLOOKUP(E140,'Siatka płac'!$B$6:$E$17,3,FALSE))),\"-\")","v":1},"IV",{"$f":"IF(G140=\"poniżej min.\",((VLOOKUP(E140,'Siatka płac'!$B$6:$D$17,3,FALSE)-C140)*(13-'Zestawienie stanowisk'!$H$1)),\"-\")","v":"-"}]
[1,"Magazynier",4000,"Pracownik 137",{"$f":"IFERROR((VLOOKUP(B141,'Zestawienie stanowisk'!$B$5:$E$65,4,FALSE)),\"-\")","v":1},{"$f":"IFERROR(((C141-(VLOOKUP(E141,'Siatka płac'!$B$6:$E$17,3,FALSE)))/(VLOOKUP(E141,'Siatka płac'!$B$6:$E$17,4,FALSE)-VLOOKUP(E141,'Siatka płac'!$B$6:$E$17,3,FALSE))),\"-\")","v":1},"IV",{"$f":"IF(G141=\"poniżej min.\",((VLOOKUP(E141,'Siatka płac'!$B$6:$D$17,3,FALSE)-C141)*(13-'Zestawienie stanowisk'!$H$1)),\"-\")","v":"-"}]
[1,"Magazynier",4000,"Pracownik 138",{"$f":"IFERROR((VLOOKUP(B142,'Zestawienie stanowisk'!$B$5:$E$65,4,FALSE)),\"-\")","v":1},{"$f":"IFERROR(((C142-(VLOOKUP(E142,'Siatka płac'!$B$6:$E$17,3,FALSE)))/(VLOOKUP(E142,'Siatka płac'!$B$6:$E$17,4,FALSE)-VLOOKUP(E142,'Siatka płac'!$B$6:$E$17,3,FALSE))),\"-\")","v":1},"IV",{"$f":"IF(G142=\"poniżej min.\",((VLOOKUP(E142,'Siatka płac'!$B$6:$D$17,3,FALSE)-C142)*(13-'Zestawienie stanowisk'!$H$1)),\"-\")","v":"-"}]
[1,"Magazynier",4000,"Pracownik 139",{"$f":"IFERROR((VLOOKUP(B143,'Zestawienie stanowisk'!$B$5:$E$65,4,FALSE)),\"-\")","v":1},{"$f":"IFERROR(((C143-(VLOOKUP(E143,'Siatka płac'!$B$6:$E$17,3,FALSE)))/(VLOOKUP(E143,'Siatka płac'!$B$6:$E$17,4,FALSE)-VLOOKUP(E143,'Siatka płac'!$B$6:$E$17,3,FALSE))),\"-\")","v":1},"IV",{"$f":"IF(G143=\"poniżej min.\",((VLOOKUP(E143,'Siatka płac'!$B$6:$D$17,3,FALSE)-C143)*(13-'Zestawienie stanowisk'!$H$1)),\"-\")","v":"-"}]
[1,"Magazynier",4000,"Pracownik 140",{"$f":"IFERROR((VLOOKUP(B144,'Zestawienie stanowisk'!$B$5:$E$65,4,FALSE)),\"-\")","v":1},{"$f":"IFERROR(((C144-(VLOOKUP(E144,'Siatka płac'!$B$6:$E$17,3,FALSE)))/(VLOOKUP(E144,'Siatka płac'!$B$6:$E$17,4,FALSE)-VLOOKUP(E144,'Siatka płac'!$B$6:$E$17,3,FALSE))),\"-\")","v":1},"IV",{"$f":"IF(G144=\"poniżej min.\",((VLOOKUP(E144,'Siatka płac'!$B$6:$D$17,3,FALSE)-C144)*(13-'Zestawienie stanowisk'!$H$1)),\"-\")","v":"-"}]
[1,"Magazynier",2800,"Pracownik 141",{"$f":"IFERROR((VLOOKUP(B145,'Zestawienie stanowisk'!$B$5:$E$65,4,FALSE)),\"-\")","v":1},{"$f":"IFERROR(((C145-(VLOOKUP(E145,'Siatka płac'!$B$6:$E$17,3,FALSE)))/(VLOOKUP(E145,'Siatka płac'!$B$6:$E$17,4,FALSE)-VLOOKUP(E145,'Siatka płac'!$B$6:$E$17,3,FALSE))),\"-\")","v":0.4},"II",{"$f":"IF(G145=\"poniżej min.\",((VLOOKUP(E145,'Siatka płac'!$B$6:$D$17,3,FALSE)-C145)*(13-'Zestawienie stanowisk'!$H$1)),\"-\")","v":"-"}]
[1,"Magazynier",2800,"Pracownik 142",{"$f":"IFERROR((VLOOKUP(B146,'Zestawienie stanowisk'!$B$5:$E$65,4,FALSE)),\"-\")","v":1},{"$f":"IFERROR(((C146-(VLOOKUP(E146,'Siatka płac'!$B$6:$E$17,3,FALSE)))/(VLOOKUP(E146,'Siatka płac'!$B$6:$E$17,4,FALSE)-VLOOKUP(E146,'Siatka płac'!$B$6:$E$17,3,FALSE))),\"-\")","v":0.4},"II",{"$f":"IF(G146=\"poniżej min.\",((VLOOKUP(E146,'Siatka płac'!$B$6:$D$17,3,FALSE)-C146)*(13-'Zestawienie stanowisk'!$H$1)),\"-\")","v":"-"}]
[1,"Magazynier",2800,"Pracownik 143",{"$f":"IFERROR((VLOOKUP(B147,'Zestawienie stanowisk'!$B$5:$E$65,4,FALSE)),\"-\")","v":1},{"$f":"IFERROR(((C147-(VLOOKUP(E147,'Siatka płac'!$B$6:$E$17,3,FALSE)))/(VLOOKUP(E147,'Siatka płac'!$B$6:$E$17,4,FALSE)-VLOOKUP(E147,'Siatka płac'!$B$6:$E$17,3,FALSE))),\"-\")","v":0.4},"II",{"$f":"IF(G147=\"poniżej min.\",((VLOOKUP(E147,'Siatka płac'!$B$6:$D$17,3,FALSE)-C147)*(13-'Zestawienie stanowisk'!$H$1)),\"-\")","v":"-"}]
[1,"Magazynier",2800,"Pracownik 144",{"$f":"IFERROR((VLOOKUP(B148,'Zestawienie stanowisk'!$B$5:$E$65,4,FALSE)),\"-\")","v":1},{"$f":"IFERROR(((C148-(VLOOKUP(E148,'Siatka płac'!$B$6:$E$17,3,FALSE)))/(VLOOKUP(E148,'Siatka płac'!$B$6:$E$17,4,FALSE)-VLOOKUP(E148,'Siatka płac'!$B$6:$E$17,3,FALSE))),\"-\")","v":0.4},"II",{"$f":"IF(G148=\"poniżej min.\",((VLOOKUP(E148,'Siatka płac'!$B$6:$D$17,3,FALSE)-C148)*(13-'Zestawienie stanowisk'!$H$1)),\"-\")","v":"-"}]
[1,"Magazynier",2800,"Pracownik 145",{"$f":"IFERROR((VLOOKUP(B149,'Zestawienie stanowisk'!$B$5:$E$65,4,FALSE)),\"-\")","v":1},{"$f":"IFERROR(((C149-(VLOOKUP(E149,'Siatka płac'!$B$6:$E$17,3,FALSE)))/(VLOOKUP(E149,'Siatka płac'!$B$6:$E$17,4,FALSE)-VLOOKUP(E149,'Siatka płac'!$B$6:$E$17,3,FALSE))),\"-\")","v":0.4},"II",{"$f":"IF(G149=\"poniżej min.\",((VLOOKUP(E149,'Siatka płac'!$B$6:$D$17,3,FALSE)-C149)*(13-'Zestawienie stanowisk'!$H$1)),\"-\")","v":"-"}]
[1,"Magazynier",2800,"Pracownik 146",{"$f":"IFERROR((VLOOKUP(B150,'Zestawienie stanowisk'!$B$5:$E$65,4,FALSE)),\"-\")","v":1},{"$f":"IFERROR(((C150-(VLOOKUP(E150,'Siatka płac'!$B$6:$E$17,3,FALSE)))/(VLOOKUP(E150,'Siatka płac'!$B$6:$E$17,4,FALSE)-VLOOKUP(E150,'Siatka płac'!$B$6:$E$17,3,FALSE))),\"-\")","v":0.4},"II",{"$f":"IF(G150=\"poniżej min.\",((VLOOKUP(E150,'Siatka płac'!$B$6:$D$17,3,FALSE)-C150)*(13-'Zestawienie stanowisk'!$H$1)),\"-\")","v":"-"}]
[1,"Magazynier",2800,"Pracownik 147",{"$f":"IFERROR((VLOOKUP(B151,'Zestawienie stanowisk'!$B$5:$E$65,4,FALSE)),\"-\")","v":1},{"$f":"IFERROR(((C151-(VLOOKUP(E151,'Siatka płac'!$B$6:$E$17,3,FALSE)))/(VLOOKUP(E151,'Siatka płac'!$B$6:$E$17,4,FALSE)-VLOOKUP(E151,'Siatka płac'!$B$6:$E$17,3,FALSE))),\"-\")","v":0.4},"II",{"$f":"IF(G151=\"poniżej min.\",((VLOOKUP(E151,'Siatka płac'!$B$6:$D$17,3,FALSE)-C151)*(13-'Zestawienie stanowisk'!$H$1)),\"-\")","v":"-"}]
[1,"Magazynier",2800,"Pracownik 148",{"$f":"IFERROR((VLOOKUP(B152,'Zestawienie stanowisk'!$B$5:$E$65,4,FALSE)),\"-\")","v":1},{"$f":"IFERROR(((C152-(VLOOKUP(E152,'Siatka płac'!$B$6:$E$17,3,FALSE)))/(VLOOKUP(E152,'Siatka płac'!$B$6:$E$17,4,FALSE)-VLOOKUP(E152,'Siatka płac'!$B$6:$E$17,3,FALSE))),\"-\")","v":0.4},"II",{"$f":"IF(G152=\"poniżej min.\",((VLOOKUP(E152,'Siatka płac'!$B$6:$D$17,3,FALSE)-C152)*(13-'Zestawienie stanowisk'!$H$1)),\"-\")","v":"-"}]
[1,"Magazynier",2800,"Pracownik 149",{"$f":"IFERROR((VLOOKUP(B153,'Zestawienie stanowisk'!$B$5:$E$65,4,FALSE)),\"-\")","v":1},{"$f":"IFERROR(((C153-(VLOOKUP(E153,'Siatka płac'!$B$6:$E$17,3,FALSE)))/(VLOOKUP(E153,'Siatka płac'!$B$6:$E$17,4,FALSE)-VLOOKUP(E153,'Siatka płac'!$B$6:$E$17,3,FALSE))),\"-\")","v":0.4},"II",{"$f":"IF(G153=\"poniżej min.\",((VLOOKUP(E153,'Siatka płac'!$B$6:$D$17,3,FALSE)-C153)*(13-'Zestawienie stanowisk'!$H$1)),\"-\")","v":"-"}]
[1,"Magazynier",2800,"Pracownik 150",{"$f":"IFERROR((VLOOKUP(B154,'Zestawienie stanowisk'!$B$5:$E$65,4,FALSE)),\"-\")","v":1},{"$f":"IFERROR(((C154-(VLOOKUP(E154,'Siatka płac'!$B$6:$E$17,3,FALSE)))/(VLOOKUP(E154,'Siatka płac'!$B$6:$E$17,4,FALSE)-VLOOKUP(E154,'Siatka płac'!$B$6:$E$17,3,FALSE))),\"-\")","v":0.4},"II",{"$f":"IF(G154=\"poniżej min.\",((VLOOKUP(E154,'Siatka płac'!$B$6:$D$17,3,FALSE)-C154)*(13-'Zestawienie stanowisk'!$H$1)),\"-\")","v":"-"}]
[1,"Magazynier",2800,"Pracownik 151",{"$f":"IFERROR((VLOOKUP(B155,'Zestawienie stanowisk'!$B$5:$E$65,4,FALSE)),\"-\")","v":1},{"$f":"IFERROR(((C155-(VLOOKUP(E155,'Siatka płac'!$B$6:$E$17,3,FALSE)))/(VLOOKUP(E155,'Siatka płac'!$B$6:$E$17,4,FALSE)-VLOOKUP(E155,'Siatka płac'!$B$6:$E$17,3,FALSE))),\"-\")","v":0.4},"II",{"$f":"IF(G155=\"poniżej min.\",((VLOOKUP(E155,'Siatka płac'!$B$6:$D$17,3,FALSE)-C155)*(13-'Zestawienie stanowisk'!$H$1)),\"-\")","v":"-"}]
[1,"Monter",2500,"Pracownik 152",{"$f":"IFERROR((VLOOKUP(B156,'Zestawienie stanowisk'!$B$5:$E$65,4,FALSE)),\"-\")","v":1},{"$f":"IFERROR(((C156-(VLOOKUP(E156,'Siatka płac'!$B$6:$E$17,3,FALSE)))/(VLOOKUP(E156,'Siatka płac'!$B$6:$E$17,4,FALSE)-VLOOKUP(E156,'Siatka płac'!$B$6:$E$17,3,FALSE))),\"-\")","v":0.25},"I",{"$f":"IF(G156=\"poniżej min.\",((VLOOKUP(E156,'Siatka płac'!$B$6:$D$17,3,FALSE)-C156)*(13-'Zestawienie stanowisk'!$H$1)),\"-\")","v":"-"}]
[1,"Monter",2500,"Pracownik 153",{"$f":"IFERROR((VLOOKUP(B157,'Zestawienie stanowisk'!$B$5:$E$65,4,FALSE)),\"-\")","v":1},{"$f":"IFERROR(((C157-(VLOOKUP(E157,'Siatka płac'!$B$6:$E$17,3,FALSE)))/(VLOOKUP(E157,'Siatka płac'!$B$6:$E$17,4,FALSE)-VLOOKUP(E157,'Siatka płac'!$B$6:$E$17,3,FALSE))),\"-\")","v":0.25},"I",{"$f":"IF(G157=\"poniżej min.\",((VLOOKUP(E157,'Siatka płac'!$B$6:$D$17,3,FALSE)-C157)*(13-'Zestawienie stanowisk'!$H$1)),\"-\")","v":"-"}]
[1,"Monter",2500,"Pracownik 154",{"$f":"IFERROR((VLOOKUP(B158,'Zestawienie stanowisk'!$B$5:$E$65,4,FALSE)),\"-\")","v":1},{"$f":"IFERROR(((C158-(VLOOKUP(E158,'Siatka płac'!$B$6:$E$17,3,FALSE)))/(VLOOKUP(E158,'Siatka płac'!$B$6:$E$17,4,FALSE)-VLOOKUP(E158,'Siatka płac'!$B$6:$E$17,3,FALSE))),\"-\")","v":0.25},"I",{"$f":"IF(G158=\"poniżej min.\",((VLOOKUP(E158,'Siatka płac'!$B$6:$D$17,3,FALSE)-C158)*(13-'Zestawienie stanowisk'!$H$1)),\"-\")","v":"-"}]
[1,"Kierowca",4000,"Pracownik 155",{"$f":"IFERROR((VLOOKUP(B159,'Zestawienie stanowisk'!$B$5:$E$65,4,FALSE)),\"-\")","v":1},{"$f":"IFERROR(((C159-(VLOOKUP(E159,'Siatka płac'!$B$6:$E$17,3,FALSE)))/(VLOOKUP(E159,'Siatka płac'!$B$6:$E$17,4,FALSE)-VLOOKUP(E159,'Siatka płac'!$B$6:$E$17,3,FALSE))),\"-\")","v":1},"IV",{"$f":"IF(G159=\"poniżej min.\",((VLOOKUP(E159,'Siatka płac'!$B$6:$D$17,3,FALSE)-C159)*(13-'Zestawienie stanowisk'!$H$1)),\"-\")","v":"-"}]
[1,"Kierowca",4100,"Pracownik 156",{"$f":"IFERROR((VLOOKUP(B160,'Zestawienie stanowisk'!$B$5:$E$65,4,FALSE)),\"-\")","v":1},{"$f":"IFERROR(((C160-(VLOOKUP(E160,'Siatka płac'!$B$6:$E$17,3,FALSE)))/(VLOOKUP(E160,'Siatka płac'!$B$6:$E$17,4,FALSE)-VLOOKUP(E160,'Siatka płac'!$B$6:$E$17,3,FALSE))),\"-\")","v":1.05},"powyżej maks.",{"$f":"IF(G160=\"poniżej min.\",((VLOOKUP(E160,'Siatka płac'!$B$6:$D$17,3,FALSE)-C160)*(13-'Zestawienie stanowisk'!$H$1)),\"-\")","v":"-"}]
[1,"Kierowca",4200,"Pracownik 157",{"$f":"IFERROR((VLOOKUP(B161,'Zestawienie stanowisk'!$B$5:$E$65,4,FALSE)),\"-\")","v":1},{"$f":"IFERROR(((C161-(VLOOKUP(E161,'Siatka płac'!$B$6:$E$17,3,FALSE)))/(VLOOKUP(E161,'Siatka płac'!$B$6:$E$17,4,FALSE)-VLOOKUP(E161,'Siatka płac'!$B$6:$E$17,3,FALSE))),\"-\")","v":1.1000000000000001},"powyżej maks.",{"$f":"IF(G161=\"poniżej min.\",((VLOOKUP(E161,'Siatka płac'!$B$6:$D$17,3,FALSE)-C161)*(13-'Zestawienie stanowisk'!$H$1)),\"-\")","v":"-"}]
[1,"Kierowca",3200,"Pracownik 158",{"$f":"IFERROR((VLOOKUP(B162,'Zestawienie stanowisk'!$B$5:$E$65,4,FALSE)),\"-\")","v":1},{"$f":"IFERROR(((C162-(VLOOKUP(E162,'Siatka płac'!$B$6:$E$17,3,FALSE)))/(VLOOKUP(E162,'Siatka płac'!$B$6:$E$17,4,FALSE)-VLOOKUP(E162,'Siatka płac'!$B$6:$E$17,3,FALSE))),\"-\")","v":0.6},"III",{"$f":"IF(G162=\"poniżej min.\",((VLOOKUP(E162,'Siatka płac'!$B$6:$D$17,3,FALSE)-C162)*(13-'Zestawienie stanowisk'!$H$1)),\"-\")","v":"-"}]
[1,"Kierowca",3600,"Pracownik 159",{"$f":"IFERROR((VLOOKUP(B163,'Zestawienie stanowisk'!$B$5:$E$65,4,FALSE)),\"-\")","v":1},{"$f":"IFERROR(((C163-(VLOOKUP(E163,'Siatka płac'!$B$6:$E$17,3,FALSE)))/(VLOOKUP(E163,'Siatka płac'!$B$6:$E$17,4,FALSE)-VLOOKUP(E163,'Siatka płac'!$B$6:$E$17,3,FALSE))),\"-\")","v":0.8},"IV",{"$f":"IF(G163=\"poniżej min.\",((VLOOKUP(E163,'Siatka płac'!$B$6:$D$17,3,FALSE)-C163)*(13-'Zestawienie stanowisk'!$H$1)),\"-\")","v":"-"}]
[1,"Kierowca",3700,"Pracownik 160",{"$f":"IFERROR((VLOOKUP(B164,'Zestawienie stanowisk'!$B$5:$E$65,4,FALSE)),\"-\")","v":1},{"$f":"IFERROR(((C164-(VLOOKUP(E164,'Siatka płac'!$B$6:$E$17,3,FALSE)))/(VLOOKUP(E164,'Siatka płac'!$B$6:$E$17,4,FALSE)-VLOOKUP(E164,'Siatka płac'!$B$6:$E$17,3,FALSE))),\"-\")","v":0.85},"IV",{"$f":"IF(G164=\"poniżej min.\",((VLOOKUP(E164,'Siatka płac'!$B$6:$D$17,3,FALSE)-C164)*(13-'Zestawienie stanowisk'!$H$1)),\"-\")","v":"-"}]
[1,"Kierowca",3550,"Pracownik 161",{"$f":"IFERROR((VLOOKUP(B165,'Zestawienie stanowisk'!$B$5:$E$65,4,FALSE)),\"-\")","v":1},{"$f":"IFERROR(((C165-(VLOOKUP(E165,'Siatka płac'!$B$6:$E$17,3,FALSE)))/(VLOOKUP(E165,'Siatka płac'!$B$6:$E$17,4,FALSE)-VLOOKUP(E165,'Siatka płac'!$B$6:$E$17,3,FALSE))),\"-\")","v":0.77500000000000002},"IV",{"$f":"IF(G165=\"poniżej min.\",((VLOOKUP(E165,'Siatka płac'!$B$6:$D$17,3,FALSE)-C165)*(13-'Zestawienie stanowisk'!$H$1)),\"-\")","v":"-"}]
[1,"Kierowca",4300,"Pracownik 162",{"$f":"IFERROR((VLOOKUP(B166,'Zestawienie stanowisk'!$B$5:$E$65,4,FALSE)),\"-\")","v":1},{"$f":"IFERROR(((C166-(VLOOKUP(E166,'Siatka płac'!$B$6:$E$17,3,FALSE)))/(VLOOKUP(E166,'Siatka płac'!$B$6:$E$17,4,FALSE)-VLOOKUP(E166,'Siatka płac'!$B$6:$E$17,3,FALSE))),\"-\")","v":1.1499999999999999},"powyżej maks.",{"$f":"IF(G166=\"poniżej min.\",((VLOOKUP(E166,'Siatka płac'!$B$6:$D$17,3,FALSE)-C166)*(13-'Zestawienie stanowisk'!$H$1)),\"-\")","v":"-"}]
[1,"Kierowca",4200,"Pracownik 163",{"$f":"IFERROR((VLOOKUP(B167,'Zestawienie stanowisk'!$B$5:$E$65,4,FALSE)),\"-\")","v":1},{"$f":"IFERROR(((C167-(VLOOKUP(E167,'Siatka płac'!$B$6:$E$17,3,FALSE)))/(VLOOKUP(E167,'Siatka płac'!$B$6:$E$17,4,FALSE)-VLOOKUP(E167,'Siatka płac'!$B$6:$E$17,3,FALSE))),\"-\")","v":1.1000000000000001},"powyżej maks.",{"$f":"IF(G167=\"poniżej min.\",((VLOOKUP(E167,'Siatka płac'!$B$6:$D$17,3,FALSE)-C167)*(13-'Zestawienie stanowisk'!$H$1)),\"-\")","v":"-"}]
[1,"Kierowca",3600,"Pracownik 164",{"$f":"IFERROR((VLOOKUP(B168,'Zestawienie stanowisk'!$B$5:$E$65,4,FALSE)),\"-\")","v":1},{"$f":"IFERROR(((C168-(VLOOKUP(E168,'Siatka płac'!$B$6:$E$17,3,FALSE)))/(VLOOKUP(E168,'Siatka płac'!$B$6:$E$17,4,FALSE)-VLOOKUP(E168,'Siatka płac'!$B$6:$E$17,3,FALSE))),\"-\")","v":0.8},"IV",{"$f":"IF(G168=\"poniżej min.\",((VLOOKUP(E168,'Siatka płac'!$B$6:$D$17,3,FALSE)-C168)*(13-'Zestawienie stanowisk'!$H$1)),\"-\")","v":"-"}]
[1,"Kierowca",3700,"Pracownik 165",{"$f":"IFERROR((VLOOKUP(B169,'Zestawienie stanowisk'!$B$5:$E$65,4,FALSE)),\"-\")","v":1},{"$f":"IFERROR(((C169-(VLOOKUP(E169,'Siatka płac'!$B$6:$E$17,3,FALSE)))/(VLOOKUP(E169,'Siatka płac'!$B$6:$E$17,4,FALSE)-VLOOKUP(E169,'Siatka płac'!$B$6:$E$17,3,FALSE))),\"-\")","v":0.85},"IV",{"$f":"IF(G169=\"poniżej min.\",((VLOOKUP(E169,'Siatka płac'!$B$6:$D$17,3,FALSE)-C169)*(13-'Zestawienie stanowisk'!$H$1)),\"-\")","v":"-"}]
[1,"Kierowca",3400,"Pracownik 166",{"$f":"IFERROR((VLOOKUP(B170,'Zestawienie stanowisk'!$B$5:$E$65,4,FALSE)),\"-\")","v":1},{"$f":"IFERROR(((C170-(VLOOKUP(E170,'Siatka płac'!$B$6:$E$17,3,FALSE)))/(VLOOKUP(E170,'Siatka płac'!$B$6:$E$17,4,FALSE)-VLOOKUP(E170,'Siatka płac'!$B$6:$E$17,3,FALSE))),\"-\")","v":0.7},"III",{"$f":"IF(G170=\"poniżej min.\",((VLOOKUP(E170,'Siatka płac'!$B$6:$D$17,3,FALSE)-C170)*(13-'Zestawienie stanowisk'!$H$1)),\"-\")","v":"-"}]
[1,"Kierowca",3450,"Pracownik 167",{"$f":"IFERROR((VLOOKUP(B171,'Zestawienie stanowisk'!$B$5:$E$65,4,FALSE)),\"-\")","v":1},{"$f":"IFERROR(((C171-(VLOOKUP(E171,'Siatka płac'!$B$6:$E$17,3,FALSE)))/(VLOOKUP(E171,'Siatka płac'!$B$6:$E$17,4,FALSE)-VLOOKUP(E171,'Siatka płac'!$B$6:$E$17,3,FALSE))),\"-\")","v":0.72499999999999998},"III",{"$f":"IF(G171=\"poniżej min.\",((VLOOKUP(E171,'Siatka płac'!$B$6:$D$17,3,FALSE)-C171)*(13-'Zestawienie stanowisk'!$H$1)),\"-\")","v":"-"}]
[1,"Kierowca",3350,"Pracownik 168",{"$f":"IFERROR((VLOOKUP(B172,'Zestawienie stanowisk'!$B$5:$E$65,4,FALSE)),\"-\")","v":1},{"$f":"IFERROR(((C172-(VLOOKUP(E172,'Siatka płac'!$B$6:$E$17,3,FALSE)))/(VLOOKUP(E172,'Siatka płac'!$B$6:$E$17,4,FALSE)-VLOOKUP(E172,'Siatka płac'!$B$6:$E$17,3,FALSE))),\"-\")","v":0.67500000000000004},"III",{"$f":"IF(G172=\"poniżej min.\",((VLOOKUP(E172,'Siatka płac'!$B$6:$D$17,3,FALSE)-C172)*(13-'Zestawienie stanowisk'!$H$1)),\"-\")","v":"-"}]
[1,"Kierowca",3550,"Pracownik 169",{"$f":"IFERROR((VLOOKUP(B173,'Zestawienie stanowisk'!$B$5:$E$65,4,FALSE)),\"-\")","v":1},{"$f":"IFERROR(((C173-(VLOOKUP(E173,'Siatka płac'!$B$6:$E$17,3,FALSE)))/(VLOOKUP(E173,'Siatka płac'!$B$6:$E$17,4,FALSE)-VLOOKUP(E173,'Siatka płac'!$B$6:$E$17,3,FALSE))),\"-\")","v":0.77500000000000002},"IV",{"$f":"IF(G173=\"poniżej min.\",((VLOOKUP(E173,'Siatka płac'!$B$6:$D$17,3,FALSE)-C173)*(13-'Zestawienie stanowisk'!$H$1)),\"-\")","v":"-"}]
[1,"Kierowca",4000,"Pracownik 170",{"$f":"IFERROR((VLOOKUP(B174,'Zestawienie stanowisk'!$B$5:$E$65,4,FALSE)),\"-\")","v":1},{"$f":"IFERROR(((C174-(VLOOKUP(E174,'Siatka płac'!$B$6:$E$17,3,FALSE)))/(VLOOKUP(E174,'Siatka płac'!$B$6:$E$17,4,FALSE)-VLOOKUP(E174,'Siatka płac'!$B$6:$E$17,3,FALSE))),\"-\")","v":1},"IV",{"$f":"IF(G174=\"poniżej min.\",((VLOOKUP(E174,'Siatka płac'!$B$6:$D$17,3,FALSE)-C174)*(13-'Zestawienie stanowisk'!$H$1)),\"-\")","v":"-"}]
[1,"Monter",2500,"Pracownik 171",{"$f":"IFERROR((VLOOKUP(B175,'Zestawienie stanowisk'!$B$5:$E$65,4,FALSE)),\"-\")","v":1},{"$f":"IFERROR(((C175-(VLOOKUP(E175,'Siatka płac'!$B$6:$E$17,3,FALSE)))/(VLOOKUP(E175,'Siatka płac'!$B$6:$E$17,4,FALSE)-VLOOKUP(E175,'Siatka płac'!$B$6:$E$17,3,FALSE))),\"-\")","v":0.25},"I",{"$f":"IF(G175=\"poniżej min.\",((VLOOKUP(E175,'Siatka płac'!$B$6:$D$17,3,FALSE)-C175)*(13-'Zestawienie stanowisk'!$H$1)),\"-\")","v":"-"}]
[1,"Monter",2500,"Pracownik 172",{"$f":"IFERROR((VLOOKUP(B176,'Zestawienie stanowisk'!$B$5:$E$65,4,FALSE)),\"-\")","v":1},{"$f":"IFERROR(((C176-(VLOOKUP(E176,'Siatka płac'!$B$6:$E$17,3,FALSE)))/(VLOOKUP(E176,'Siatka płac'!$B$6:$E$17,4,FALSE)-VLOOKUP(E176,'Siatka płac'!$B$6:$E$17,3,FALSE))),\"-\")","v":0.25},"I",{"$f":"IF(G176=\"poniżej min.\",((VLOOKUP(E176,'Siatka płac'!$B$6:$D$17,3,FALSE)-C176)*(13-'Zestawienie stanowisk'!$H$1)),\"-\")","v":"-"}]
[1,"Monter",2500,"Pracownik 173",{"$f":"IFERROR((VLOOKUP(B177,'Zestawienie stanowisk'!$B$5:$E$65,4,FALSE)),\"-\")","v":1},{"$f":"IFERROR(((C177-(VLOOKUP(E177,'Siatka płac'!$B$6:$E$17,3,FALSE)))/(VLOOKUP(E177,'Siatka płac'!$B$6:$E$17,4,FALSE)-VLOOKUP(E177,'Siatka płac'!$B$6:$E$17,3,FALSE))),\"-\")","v":0.25},"I",{"$f":"IF(G177=\"poniżej min.\",((VLOOKUP(E177,'Siatka płac'!$B$6:$D$17,3,FALSE)-C177)*(13-'Zestawienie stanowisk'!$H$1)),\"-\")","v":"-"}]
[1,"Monter",2500,"Pracownik 174",{"$f":"IFERROR((VLOOKUP(B178,'Zestawienie stanowisk'!$B$5:$E$65,4,FALSE)),\"-\")","v":1},{"$f":"IFERROR(((C178-(VLOOKUP(E178,'Siatka płac'!$B$6:$E$17,3,FALSE)))/(VLOOKUP(E178,'Siatka płac'!$B$6:$E$17,4,FALSE)-VLOOKUP(E178,'Siatka płac'!$B$6:$E$17,3,FALSE))),\"-\")","v":0.25},"I",{"$f":"IF(G178=\"poniżej min.\",((VLOOKUP(E178,'Siatka płac'!$B$6:$D$17,3,FALSE)-C178)*(13-'Zestawienie stanowisk'!$H$1)),\"-\")","v":"-"}]
[1,"Monter",2500,"Pracownik 175",{"$f":"IFERROR((VLOOKUP(B179,'Zestawienie stanowisk'!$B$5:$E$65,4,FALSE)),\"-\")","v":1},{"$f":"IFERROR(((C179-(VLOOKUP(E179,'Siatka płac'!$B$6:$E$17,3,FALSE)))/(VLOOKUP(E179,'Siatka płac'!$B$6:$E$17,4,FALSE)-VLOOKUP(E179,'Siatka płac'!$B$6:$E$17,3,FALSE))),\"-\")","v":0.25},"I",{"$f":"IF(G179=\"poniżej min.\",((VLOOKUP(E179,'Siatka płac'!$B$6:$D$17,3,FALSE)-C179)*(13-'Zestawienie stanowisk'!$H$1)),\"-\")","v":"-"}]
[1,"Monter",2500,"Pracownik 176",{"$f":"IFERROR((VLOOKUP(B180,'Zestawienie stanowisk'!$B$5:$E$65,4,FALSE)),\"-\")","v":1},{"$f":"IFERROR(((C180-(VLOOKUP(E180,'Siatka płac'!$B$6:$E$17,3,FALSE)))/(VLOOKUP(E180,'Siatka płac'!$B$6:$E$17,4,FALSE)-VLOOKUP(E180,'Siatka płac'!$B$6:$E$17,3,FALSE))),\"-\")","v":0.25},"I",{"$f":"IF(G180=\"poniżej min.\",((VLOOKUP(E180,'Siatka płac'!$B$6:$D$17,3,FALSE)-C180)*(13-'Zestawienie stanowisk'!$H$1)),\"-\")","v":"-"}]
[1,"Monter",2500,"Pracownik 177",{"$f":"IFERROR((VLOOKUP(B181,'Zestawienie stanowisk'!$B$5:$E$65,4,FALSE)),\"-\")","v":1},{"$f":"IFERROR(((C181-(VLOOKUP(E181,'Siatka płac'!$B$6:$E$17,3,FALSE)))/(VLOOKUP(E181,'Siatka płac'!$B$6:$E$17,4,FALSE)-VLOOKUP(E181,'Siatka płac'!$B$6:$E$17,3,FALSE))),\"-\")","v":0.25},"I",{"$f":"IF(G181=\"poniżej min.\",((VLOOKUP(E181,'Siatka płac'!$B$6:$D$17,3,FALSE)-C181)*(13-'Zestawienie stanowisk'!$H$1)),\"-\")","v":"-"}]
[1,"Monter",2500,"Pracownik 178",{"$f":"IFERROR((VLOOKUP(B182,'Zestawienie stanowisk'!$B$5:$E$65,4,FALSE)),\"-\")","v":1},{"$f":"IFERROR(((C182-(VLOOKUP(E182,'Siatka płac'!$B$6:$E$17,3,FALSE)))/(VLOOKUP(E182,'Siatka płac'!$B$6:$E$17,4,FALSE)-VLOOKUP(E182,'Siatka płac'!$B$6:$E$17,3,FALSE))),\"-\")","v":0.25},"I",{"$f":"IF(G182=\"poniżej min.\",((VLOOKUP(E182,'Siatka płac'!$B$6:$D$17,3,FALSE)-C182)*(13-'Zestawienie stanowisk'!$H$1)),\"-\")","v":"-"}]
[1,"Monter",2500,"Pracownik 179",{"$f":"IFERROR((VLOOKUP(B183,'Zestawienie stanowisk'!$B$5:$E$65,4,FALSE)),\"-\")","v":1},{"$f":"IFERROR(((C183-(VLOOKUP(E183,'Siatka płac'!$B$6:$E$17,3,FALSE)))/(VLOOKUP(E183,'Siatka płac'!$B$6:$E$17,4,FALSE)-VLOOKUP(E183,'Siatka płac'!$B$6:$E$17,3,FALSE))),\"-\")","v":0.25},"I",{"$f":"IF(G183=\"poniżej min.\",((VLOOKUP(E183,'Siatka płac'!$B$6:$D$17,3,FALSE)-C183)*(13-'Zestawienie stanowisk'!$H$1)),\"-\")","v":"-"}]
[1,"Monter",2500,"Pracownik 180",{"$f":"IFERROR((VLOOKUP(B184,'Zestawienie stanowisk'!$B$5:$E$65,4,FALSE)),\"-\")","v":1},{"$f":"IFERROR(((C184-(VLOOKUP(E184,'Siatka płac'!$B$6:$E$17,3,FALSE)))/(VLOOKUP(E184,'Siatka płac'!$B$6:$E$17,4,FALSE)-VLOOKUP(E184,'Siatka płac'!$B$6:$E$17,3,FALSE))),\"-\")","v":0.25},"I",{"$f":"IF(G184=\"poniżej min.\",((VLOOKUP(E184,'Siatka płac'!$B$6:$D$17,3,FALSE)-C184)*(13-'Zestawienie stanowisk'!$H$1)),\"-\")","v":"-"}]
[1,"Monter",2500,"Pracownik 181",{"$f":"IFERROR((VLOOKUP(B185,'Zestawienie stanowisk'!$B$5:$E$65,4,FALSE)),\"-\")","v":1},{"$f":"IFERROR(((C185-(VLOOKUP(E185,'Siatka płac'!$B$6:$E$17,3,FALSE)))/(VLOOKUP(E185,'Siatka płac'!$B$6:$E$17,4,FALSE)-VLOOKUP(E185,'Siatka płac'!$B$6:$E$17,3,FALSE))),\"-\")","v":0.25},"I",{"$f":"IF(G185=\"poniżej min.\",((VLOOKUP(E185,'Siatka płac'!$B$6:$D$17,3,FALSE)-C185)*(13-'Zestawienie stanowisk'!$H$1)),\"-\")","v":"-"}]
[1,"Monter",2500,"Pracownik 182",{"$f":"IFERROR((VLOOKUP(B186,'Zestawienie stanowisk'!$B$5:$E$65,4,FALSE)),\"-\")","v":1},{"$f":"IFERROR(((C186-(VLOOKUP(E186,'Siatka płac'!$B$6:$E$17,3,FALSE)))/(VLOOKUP(E186,'Siatka płac'!$B$6:$E$17,4,FALSE)-VLOOKUP(E186,'Siatka płac'!$B$6:$E$17,3,FALSE))),\"-\")","v":0.25},"I",{"$f":"IF(G186=\"poniżej min.\",((VLOOKUP(E186,'Siatka płac'!$B$6:$D$17,3,FALSE)-C186)*(13-'Zestawienie stanowisk'!$H$1)),\"-\")","v":"-"}]
[1,"Monter",2500,"Pracownik 183",{"$f":"IFERROR((VLOOKUP(B187,'Zestawienie stanowisk'!$B$5:$E$65,4,FALSE)),\"-\")","v":1},{"$f":"IFERROR(((C187-(VLOOKUP(E187,'Siatka płac'!$B$6:$E$17,3,FALSE)))/(VLOOKUP(E187,'Siatka płac'!$B$6:$E$17,4,FALSE)-VLOOKUP(E187,'Siatka płac'!$B$6:$E$17,3,FALSE))),\"-\")","v":0.25},"I",{"$f":"IF(G187=\"poniżej min.\",((VLOOKUP(E187,'Siatka płac'!$B$6:$D$17,3,FALSE)-C187)*(13-'Zestawienie stanowisk'!$H$1)),\"-\")","v":"-"}]
[1,"Monter",2500,"Pracownik 184",{"$f":"IFERROR((VLOOKUP(B188,'Zestawienie stanowisk'!$B$5:$E$65,4,FALSE)),\"-\")","v":1},{"$f":"IFERROR(((C188-(VLOOKUP(E188,'Siatka płac'!$B$6:$E$17,3,FALSE)))/(VLOOKUP(E188,'Siatka płac'!$B$6:$E$17,4,FALSE)-VLOOKUP(E188,'Siatka płac'!$B$6:$E$17,3,FALSE))),\"-\")","v":0.25},"I",{"$f":"IF(G188=\"poniżej min.\",((VLOOKUP(E188,'Siatka płac'!$B$6:$D$17,3,FALSE)-C188)*(13-'Zestawienie stanowisk'!$H$1)),\"-\")","v":"-"}]
[1,"Monter",2500,"Pracownik 185",{"$f":"IFERROR((VLOOKUP(B189,'Zestawienie stanowisk'!$B$5:$E$65,4,FALSE)),\"-\")","v":1},{"$f":"IFERROR(((C189-(VLOOKUP(E189,'Siatka płac'!$B$6:$E$17,3,FALSE)))/(VLOOKUP(E189,'Siatka płac'!$B$6:$E$17,4,FALSE)-VLOOKUP(E189,'Siatka płac'!$B$6:$E$17,3,FALSE))),\"-\")","v":0.25},"I",{"$f":"IF(G189=\"poniżej min.\",((VLOOKUP(E189,'Siatka płac'!$B$6:$D$17,3,FALSE)-C189)*(13-'Zestawienie stanowisk'!$H$1)),\"-\")","v":"-"}]
[1,"Monter",2500,"Pracownik 186",{"$f":"IFERROR((VLOOKUP(B190,'Zestawienie stanowisk'!$B$5:$E$65,4,FALSE)),\"-\")","v":1},{"$f":"IFERROR(((C190-(VLOOKUP(E190,'Siatka płac'!$B$6:$E$17,3,FALSE)))/(VLOOKUP(E190,'Siatka płac'!$B$6:$E$17,4,FALSE)-VLOOKUP(E190,'Siatka płac'!$B$6:$E$17,3,FALSE))),\"-\")","v":0.25},"I",{"$f":"IF(G190=\"poniżej min.\",((VLOOKUP(E190,'Siatka płac'!$B$6:$D$17,3,FALSE)-C190)*(13-'Zestawienie stanowisk'!$H$1)),\"-\")","v":"-"}]
[1,"Mechanik",3300,"Pracownik 187",{"$f":"IFERROR((VLOOKUP(B191,'Zestawienie stanowisk'!$B$5:$E$65,4,FALSE)),\"-\")","v":1},{"$f":"IFERROR(((C191-(VLOOKUP(E191,'Siatka płac'!$B$6:$E$17,3,FALSE)))/(VLOOKUP(E191,'Siatka płac'!$B$6:$E$17,4,FALSE)-VLOOKUP(E191,'Siatka płac'!$B$6:$E$17,3,FALSE))),\"-\")","v":0.65},"III",{"$f":"IF(G191=\"poniżej min.\",((VLOOKUP(E191,'Siatka płac'!$B$6:$D$17,3,FALSE)-C191)*(13-'Zestawienie stanowisk'!$H$1)),\"-\")","v":"-"}]
[1,"Mechanik",3400,"Pracownik 188",{"$f":"IFERROR((VLOOKUP(B192,'Zestawienie stanowisk'!$B$5:$E$65,4,FALSE)),\"-\")","v":1},{"$f":"IFERROR(((C192-(VLOOKUP(E192,'Siatka płac'!$B$6:$E$17,3,FALSE)))/(VLOOKUP(E192,'Siatka płac'!$B$6:$E$17,4,FALSE)-VLOOKUP(E192,'Siatka płac'!$B$6:$E$17,3,FALSE))),\"-\")","v":0.7},"III",{"$f":"IF(G192=\"poniżej min.\",((VLOOKUP(E192,'Siatka płac'!$B$6:$D$17,3,FALSE)-C192)*(13-'Zestawienie stanowisk'!$H$1)),\"-\")","v":"-"}]
[1,"Mechanik",3550,"Pracownik 189",{"$f":"IFERROR((VLOOKUP(B193,'Zestawienie stanowisk'!$B$5:$E$65,4,FALSE)),\"-\")","v":1},{"$f":"IFERROR(((C193-(VLOOKUP(E193,'Siatka płac'!$B$6:$E$17,3,FALSE)))/(VLOOKUP(E193,'Siatka płac'!$B$6:$E$17,4,FALSE)-VLOOKUP(E193,'Siatka płac'!$B$6:$E$17,3,FALSE))),\"-\")","v":0.77500000000000002},"IV",{"$f":"IF(G193=\"poniżej min.\",((VLOOKUP(E193,'Siatka płac'!$B$6:$D$17,3,FALSE)-C193)*(13-'Zestawienie stanowisk'!$H$1)),\"-\")","v":"-"}]
[1,"Mechanik",3600,"Pracownik 190",{"$f":"IFERROR((VLOOKUP(B194,'Zestawienie stanowisk'!$B$5:$E$65,4,FALSE)),\"-\")","v":1},{"$f":"IFERROR(((C194-(VLOOKUP(E194,'Siatka płac'!$B$6:$E$17,3,FALSE)))/(VLOOKUP(E194,'Siatka płac'!$B$6:$E$17,4,FALSE)-VLOOKUP(E194,'Siatka płac'!$B$6:$E$17,3,FALSE))),\"-\")","v":0.8},"IV",{"$f":"IF(G194=\"poniżej min.\",((VLOOKUP(E194,'Siatka płac'!$B$6:$D$17,3,FALSE)-C194)*(13-'Zestawienie stanowisk'!$H$1)),\"-\")","v":"-"}]
[1,"Mechanik",3300,"Pracownik 191",{"$f":"IFERROR((VLOOKUP(B195,'Zestawienie stanowisk'!$B$5:$E$65,4,FALSE)),\"-\")","v":1},{"$f":"IFERROR(((C195-(VLOOKUP(E195,'Siatka płac'!$B$6:$E$17,3,FALSE)))/(VLOOKUP(E195,'Siatka płac'!$B$6:$E$17,4,FALSE)-VLOOKUP(E195,'Siatka płac'!$B$6:$E$17,3,FALSE))),\"-\")","v":0.65},"III",{"$f":"IF(G195=\"poniżej min.\",((VLOOKUP(E195,'Siatka płac'!$B$6:$D$17,3,FALSE)-C195)*(13-'Zestawienie stanowisk'!$H$1)),\"-\")","v":"-"}]
[1,"Mechanik",4000,"Pracownik 192",{"$f":"IFERROR((VLOOKUP(B196,'Zestawienie stanowisk'!$B$5:$E$65,4,FALSE)),\"-\")","v":1},{"$f":"IFERROR(((C196-(VLOOKUP(E196,'Siatka płac'!$B$6:$E$17,3,FALSE)))/(VLOOKUP(E196,'Siatka płac'!$B$6:$E$17,4,FALSE)-VLOOKUP(E196,'Siatka płac'!$B$6:$E$17,3,FALSE))),\"-\")","v":1},"IV",{"$f":"IF(G196=\"poniżej min.\",((VLOOKUP(E196,'Siatka płac'!$B$6:$D$17,3,FALSE)-C196)*(13-'Zestawienie stanowisk'!$H$1)),\"-\")","v":"-"}]
[{"$f":"IF(ISBLANK(B197),0,1)","v":1},"Mechanik",5000,"Pracownik 193",{"$f":"IFERROR((VLOOKUP(B197,'Zestawienie stanowisk'!$B$5:$E$65,4,FALSE)),\"-\")","v":1},{"$f":"IFERROR(((C197-(VLOOKUP(E197,'Siatka płac'!$B$6:$E$17,3,FALSE)))/(VLOOKUP(E197,'Siatka płac'!$B$6:$E$17,4,FALSE)-VLOOKUP(E197,'Siatka płac'!$B$6:$E$17,3,FALSE))),\"-\")","v":1.5},{"$f":"IFERROR((INDEX($N$5:$N$10,MATCH(F197,$M$5:$M$10,-1))),\"-\")","v":"powyżej maks."},{"$f":"IF(G197=\"poniżej min.\",((VLOOKUP(E197,'Siatka płac'!$B$6:$D$17,3,FALSE)-C197)*(13-'Zestawienie stanowisk'!$H$1)),\"-\")","v":"-"}]
[1,"Mechanik",4800,"Pracownik 194",{"$f":"IFERROR((VLOOKUP(B198,'Zestawienie stanowisk'!$B$5:$E$65,4,FALSE)),\"-\")","v":1},{"$f":"IFERROR(((C198-(VLOOKUP(E198,'Siatka płac'!$B$6:$E$17,3,FALSE)))/(VLOOKUP(E198,'Siatka płac'!$B$6:$E$17,4,FALSE)-VLOOKUP(E198,'Siatka płac'!$B$6:$E$17,3,FALSE))),\"-\")","v":1.4},"powyżej maks.",{"$f":"IF(G198=\"poniżej min.\",((VLOOKUP(E198,'Siatka płac'!$B$6:$D$17,3,FALSE)-C198)*(13-'Zestawienie stanowisk'!$H$1)),\"-\")","v":"-"}]
[1,"Mechanik",4600,"Pracownik 195",{"$f":"IFERROR((VLOOKUP(B199,'Zestawienie stanowisk'!$B$5:$E$65,4,FALSE)),\"-\")","v":1},{"$f":"IFERROR(((C199-(VLOOKUP(E199,'Siatka płac'!$B$6:$E$17,3,FALSE)))/(VLOOKUP(E199,'Siatka płac'!$B$6:$E$17,4,FALSE)-VLOOKUP(E199,'Siatka płac'!$B$6:$E$17,3,FALSE))),\"-\")","v":1.3},"powyżej maks.",{"$f":"IF(G199=\"poniżej min.\",((VLOOKUP(E199,'Siatka płac'!$B$6:$D$17,3,FALSE)-C199)*(13-'Zestawienie stanowisk'!$H$1)),\"-\")","v":"-"}]
[1,"Mechanik",4800,"Pracownik 196",{"$f":"IFERROR((VLOOKUP(B200,'Zestawienie stanowisk'!$B$5:$E$65,4,FALSE)),\"-\")","v":1},{"$f":"IFERROR(((C200-(VLOOKUP(E200,'Siatka płac'!$B$6:$E$17,3,FALSE)))/(VLOOKUP(E200,'Siatka płac'!$B$6:$E$17,4,FALSE)-VLOOKUP(E200,'Siatka płac'!$B$6:$E$17,3,FALSE))),\"-\")","v":1.4},"powyżej maks.",{"$f":"IF(G200=\"poniżej min.\",((VLOOKUP(E200,'Siatka płac'!$B$6:$D$17,3,FALSE)-C200)*(13-'Zestawienie stanowisk'!$H$1)),\"-\")","v":"-"}]
[1,"Mechanik",3600,"Pracownik 197",{"$f":"IFERROR((VLOOKUP(B201,'Zestawienie stanowisk'!$B$5:$E$65,4,FALSE)),\"-\")","v":1},{"$f":"IFERROR(((C201-(VLOOKUP(E201,'Siatka płac'!$B$6:$E$17,3,FALSE)))/(VLOOKUP(E201,'Siatka płac'!$B$6:$E$17,4,FALSE)-VLOOKUP(E201,'Siatka płac'!$B$6:$E$17,3,FALSE))),\"-\")","v":0.8},"IV",{"$f":"IF(G201=\"poniżej min.\",((VLOOKUP(E201,'Siatka płac'!$B$6:$D$17,3,FALSE)-C201)*(13-'Zestawienie stanowisk'!$H$1)),\"-\")","v":"-"}]
[1,"Mechanik",3700,"Pracownik 198",{"$f":"IFERROR((VLOOKUP(B202,'Zestawienie stanowisk'!$B$5:$E$65,4,FALSE)),\"-\")","v":1},{"$f":"IFERROR(((C202-(VLOOKUP(E202,'Siatka płac'!$B$6:$E$17,3,FALSE)))/(VLOOKUP(E202,'Siatka płac'!$B$6:$E$17,4,FALSE)-VLOOKUP(E202,'Siatka płac'!$B$6:$E$17,3,FALSE))),\"-\")","v":0.85},"IV",{"$f":"IF(G202=\"poniżej min.\",((VLOOKUP(E202,'Siatka płac'!$B$6:$D$17,3,FALSE)-C202)*(13-'Zestawienie stanowisk'!$H$1)),\"-\")","v":"-"}]
[1,"Mechanik",3200,"Pracownik 199",{"$f":"IFERROR((VLOOKUP(B203,'Zestawienie stanowisk'!$B$5:$E$65,4,FALSE)),\"-\")","v":1},{"$f":"IFERROR(((C203-(VLOOKUP(E203,'Siatka płac'!$B$6:$E$17,3,FALSE)))/(VLOOKUP(E203,'Siatka płac'!$B$6:$E$17,4,FALSE)-VLOOKUP(E203,'Siatka płac'!$B$6:$E$17,3,FALSE))),\"-\")","v":0.6},"III",{"$f":"IF(G203=\"poniżej min.\",((VLOOKUP(E203,'Siatka płac'!$B$6:$D$17,3,FALSE)-C203)*(13-'Zestawienie stanowisk'!$H$1)),\"-\")","v":"-"}]
[1,"Mechanik",3550,"Pracownik 200",{"$f":"IFERROR((VLOOKUP(B204,'Zestawienie stanowisk'!$B$5:$E$65,4,FALSE)),\"-\")","v":1},{"$f":"IFERROR(((C204-(VLOOKUP(E204,'Siatka płac'!$B$6:$E$17,3,FALSE)))/(VLOOKUP(E204,'Siatka płac'!$B$6:$E$17,4,FALSE)-VLOOKUP(E204,'Siatka płac'!$B$6:$E$17,3,FALSE))),\"-\")","v":0.77500000000000002},"IV",{"$f":"IF(G204=\"poniżej min.\",((VLOOKUP(E204,'Siatka płac'!$B$6:$D$17,3,FALSE)-C204)*(13-'Zestawienie stanowisk'!$H$1)),\"-\")","v":"-"}]
[1,"Mechanik",4000,"Pracownik 201",{"$f":"IFERROR((VLOOKUP(B205,'Zestawienie stanowisk'!$B$5:$E$65,4,FALSE)),\"-\")","v":1},{"$f":"IFERROR(((C205-(VLOOKUP(E205,'Siatka płac'!$B$6:$E$17,3,FALSE)))/(VLOOKUP(E205,'Siatka płac'!$B$6:$E$17,4,FALSE)-VLOOKUP(E205,'Siatka płac'!$B$6:$E$17,3,FALSE))),\"-\")","v":1},"IV",{"$f":"IF(G205=\"poniżej min.\",((VLOOKUP(E205,'Siatka płac'!$B$6:$D$17,3,FALSE)-C205)*(13-'Zestawienie stanowisk'!$H$1)),\"-\")","v":"-"}]
[1,"Mechanik",4000,"Pracownik 202",{"$f":"IFERROR((VLOOKUP(B206,'Zestawienie stanowisk'!$B$5:$E$65,4,FALSE)),\"-\")","v":1},{"$f":"IFERROR(((C206-(VLOOKUP(E206,'Siatka płac'!$B$6:$E$17,3,FALSE)))/(VLOOKUP(E206,'Siatka płac'!$B$6:$E$17,4,FALSE)-VLOOKUP(E206,'Siatka płac'!$B$6:$E$17,3,FALSE))),\"-\")","v":1},"IV",{"$f":"IF(G206=\"poniżej min.\",((VLOOKUP(E206,'Siatka płac'!$B$6:$D$17,3,FALSE)-C206)*(13-'Zestawienie stanowisk'!$H$1)),\"-\")","v":"-"}]
[1,"Mechanik",4000,"Pracownik 203",{"$f":"IFERROR((VLOOKUP(B207,'Zestawienie stanowisk'!$B$5:$E$65,4,FALSE)),\"-\")","v":1},{"$f":"IFERROR(((C207-(VLOOKUP(E207,'Siatka płac'!$B$6:$E$17,3,FALSE)))/(VLOOKUP(E207,'Siatka płac'!$B$6:$E$17,4,FALSE)-VLOOKUP(E207,'Siatka płac'!$B$6:$E$17,3,FALSE))),\"-\")","v":1},"IV",{"$f":"IF(G207=\"poniżej min.\",((VLOOKUP(E207,'Siatka płac'!$B$6:$D$17,3,FALSE)-C207)*(13-'Zestawienie stanowisk'!$H$1)),\"-\")","v":"-"}]
[1,"Monter",2500,"Pracownik 204",{"$f":"IFERROR((VLOOKUP(B208,'Zestawienie stanowisk'!$B$5:$E$65,4,FALSE)),\"-\")","v":1},{"$f":"IFERROR(((C208-(VLOOKUP(E208,'Siatka płac'!$B$6:$E$17,3,FALSE)))/(VLOOKUP(E208,'Siatka płac'!$B$6:$E$17,4,FALSE)-VLOOKUP(E208,'Siatka płac'!$B$6:$E$17,3,FALSE))),\"-\")","v":0.25},"I",{"$f":"IF(G208=\"poniżej min.\",((VLOOKUP(E208,'Siatka płac'!$B$6:$D$17,3,FALSE)-C208)*(13-'Zestawienie stanowisk'!$H$1)),\"-\")","v":"-"}]
[1,"Automatyk",5250,"Pracownik 205",{"$f":"IFERROR((VLOOKUP(B209,'Zestawienie stanowisk'!$B$5:$E$65,4,FALSE)),\"-\")","v":1},{"$f":"IFERROR(((C209-(VLOOKUP(E209,'Siatka płac'!$B$6:$E$17,3,FALSE)))/(VLOOKUP(E209,'Siatka płac'!$B$6:$E$17,4,FALSE)-VLOOKUP(E209,'Siatka płac'!$B$6:$E$17,3,FALSE))),\"-\")","v":1.625},"powyżej maks.",{"$f":"IF(G209=\"poniżej min.\",((VLOOKUP(E209,'Siatka płac'!$B$6:$D$17,3,FALSE)-C209)*(13-'Zestawienie stanowisk'!$H$1)),\"-\")","v":"-"}]
[1,"Automatyk",5400,"Pracownik 206",{"$f":"IFERROR((VLOOKUP(B210,'Zestawienie stanowisk'!$B$5:$E$65,4,FALSE)),\"-\")","v":1},{"$f":"IFERROR(((C210-(VLOOKUP(E210,'Siatka płac'!$B$6:$E$17,3,FALSE)))/(VLOOKUP(E210,'Siatka płac'!$B$6:$E$17,4,FALSE)-VLOOKUP(E210,'Siatka płac'!$B$6:$E$17,3,FALSE))),\"-\")","v":1.7},"powyżej maks.",{"$f":"IF(G210=\"poniżej min.\",((VLOOKUP(E210,'Siatka płac'!$B$6:$D$17,3,FALSE)-C210)*(13-'Zestawienie stanowisk'!$H$1)),\"-\")","v":"-"}]
[1,"Automatyk",6000,"Pracownik 207",{"$f":"IFERROR((VLOOKUP(B211,'Zestawienie stanowisk'!$B$5:$E$65,4,FALSE)),\"-\")","v":1},{"$f":"IFERROR(((C211-(VLOOKUP(E211,'Siatka płac'!$B$6:$E$17,3,FALSE)))/(VLOOKUP(E211,'Siatka płac'!$B$6:$E$17,4,FALSE)-VLOOKUP(E211,'Siatka płac'!$B$6:$E$17,3,FALSE))),\"-\")","v":2},"powyżej maks.",{"$f":"IF(G211=\"poniżej min.\",((VLOOKUP(E211,'Siatka płac'!$B$6:$D$17,3,FALSE)-C211)*(13-'Zestawienie stanowisk'!$H$1)),\"-\")","v":"-"}]
[1,"Automatyk",5900,"Pracownik 208",{"$f":"IFERROR((VLOOKUP(B212,'Zestawienie stanowisk'!$B$5:$E$65,4,FALSE)),\"-\")","v":1},{"$f":"IFERROR(((C212-(VLOOKUP(E212,'Siatka płac'!$B$6:$E$17,3,FALSE)))/(VLOOKUP(E212,'Siatka płac'!$B$6:$E$17,4,FALSE)-VLOOKUP(E212,'Siatka płac'!$B$6:$E$17,3,FALSE))),\"-\")","v":1.95},"powyżej maks.",{"$f":"IF(G212=\"poniżej min.\",((VLOOKUP(E212,'Siatka płac'!$B$6:$D$17,3,FALSE)-C212)*(13-'Zestawienie stanowisk'!$H$1)),\"-\")","v":"-"}]
[1,"Automatyk",7000,"Pracownik 209",{"$f":"IFERROR((VLOOKUP(B213,'Zestawienie stanowisk'!$B$5:$E$65,4,FALSE)),\"-\")","v":1},{"$f":"IFERROR(((C213-(VLOOKUP(E213,'Siatka płac'!$B$6:$E$17,3,FALSE)))/(VLOOKUP(E213,'Siatka płac'!$B$6:$E$17,4,FALSE)-VLOOKUP(E213,'Siatka płac'!$B$6:$E$17,3,FALSE))),\"-\")","v":2.5},"powyżej maks.",{"$f":"IF(G213=\"poniżej min.\",((VLOOKUP(E213,'Siatka płac'!$B$6:$D$17,3,FALSE)-C213)*(13-'Zestawienie stanowisk'!$H$1)),\"-\")","v":"-"}]
[1,"Automatyk",8000,"Pracownik 210",{"$f":"IFERROR((VLOOKUP(B214,'Zestawienie stanowisk'!$B$5:$E$65,4,FALSE)),\"-\")","v":1},{"$f":"IFERROR(((C214-(VLOOKUP(E214,'Siatka płac'!$B$6:$E$17,3,FALSE)))/(VLOOKUP(E214,'Siatka płac'!$B$6:$E$17,4,FALSE)-VLOOKUP(E214,'Siatka płac'!$B$6:$E$17,3,FALSE))),\"-\")","v":3},"powyżej maks.",{"$f":"IF(G214=\"poniżej min.\",((VLOOKUP(E214,'Siatka płac'!$B$6:$D$17,3,FALSE)-C214)*(13-'Zestawienie stanowisk'!$H$1)),\"-\")","v":"-"}]
[1,"Automatyk",7500,"Pracownik 211",{"$f":"IFERROR((VLOOKUP(B215,'Zestawienie stanowisk'!$B$5:$E$65,4,FALSE)),\"-\")","v":1},{"$f":"IFERROR(((C215-(VLOOKUP(E215,'Siatka płac'!$B$6:$E$17,3,FALSE)))/(VLOOKUP(E215,'Siatka płac'!$B$6:$E$17,4,FALSE)-VLOOKUP(E215,'Siatka płac'!$B$6:$E$17,3,FALSE))),\"-\")","v":2.75},"powyżej maks.",{"$f":"IF(G215=\"poniżej min.\",((VLOOKUP(E215,'Siatka płac'!$B$6:$D$17,3,FALSE)-C215)*(13-'Zestawienie stanowisk'!$H$1)),\"-\")","v":"-"}]
[1,"Automatyk",6200,"Pracownik 212",{"$f":"IFERROR((VLOOKUP(B216,'Zestawienie stanowisk'!$B$5:$E$65,4,FALSE)),\"-\")","v":1},{"$f":"IFERROR(((C216-(VLOOKUP(E216,'Siatka płac'!$B$6:$E$17,3,FALSE)))/(VLOOKUP(E216,'Siatka płac'!$B$6:$E$17,4,FALSE)-VLOOKUP(E216,'Siatka płac'!$B$6:$E$17,3,FALSE))),\"-\")","v":2.1},"powyżej maks.",{"$f":"IF(G216=\"poniżej min.\",((VLOOKUP(E216,'Siatka płac'!$B$6:$D$17,3,FALSE)-C216)*(13-'Zestawienie stanowisk'!$H$1)),\"-\")","v":"-"}]
[1,"Automatyk",5000,"Pracownik 213",{"$f":"IFERROR((VLOOKUP(B217,'Zestawienie stanowisk'!$B$5:$E$65,4,FALSE)),\"-\")","v":1},{"$f":"IFERROR(((C217-(VLOOKUP(E217,'Siatka płac'!$B$6:$E$17,3,FALSE)))/(VLOOKUP(E217,'Siatka płac'!$B$6:$E$17,4,FALSE)-VLOOKUP(E217,'Siatka płac'!$B$6:$E$17,3,FALSE))),\"-\")","v":1.5},"powyżej maks.",{"$f":"IF(G217=\"poniżej min.\",((VLOOKUP(E217,'Siatka płac'!$B$6:$D$17,3,FALSE)-C217)*(13-'Zestawienie stanowisk'!$H$1)),\"-\")","v":"-"}]
[1,"Automatyk",8800,"Pracownik 214",{"$f":"IFERROR((VLOOKUP(B218,'Zestawienie stanowisk'!$B$5:$E$65,4,FALSE)),\"-\")","v":1},{"$f":"IFERROR(((C218-(VLOOKUP(E218,'Siatka płac'!$B$6:$E$17,3,FALSE)))/(VLOOKUP(E218,'Siatka płac'!$B$6:$E$17,4,FALSE)-VLOOKUP(E218,'Siatka płac'!$B$6:$E$17,3,FALSE))),\"-\")","v":3.4},"powyżej maks.",{"$f":"IF(G218=\"poniżej min.\",((VLOOKUP(E218,'Siatka płac'!$B$6:$D$17,3,FALSE)-C218)*(13-'Zestawienie stanowisk'!$H$1)),\"-\")","v":"-"}]
[1,"Monter",2500,"Pracownik 215",{"$f":"IFERROR((VLOOKUP(B219,'Zestawienie stanowisk'!$B$5:$E$65,4,FALSE)),\"-\")","v":1},{"$f":"IFERROR(((C219-(VLOOKUP(E219,'Siatka płac'!$B$6:$E$17,3,FALSE)))/(VLOOKUP(E219,'Siatka płac'!$B$6:$E$17,4,FALSE)-VLOOKUP(E219,'Siatka płac'!$B$6:$E$17,3,FALSE))),\"-\")","v":0.25},"I",{"$f":"IF(G219=\"poniżej min.\",((VLOOKUP(E219,'Siatka płac'!$B$6:$D$17,3,FALSE)-C219)*(13-'Zestawienie stanowisk'!$H$1)),\"-\")","v":"-"}]
[1,"Specjalista ds. księgowych",6000,"Pracownik 216",{"$f":"IFERROR((VLOOKUP(B220,'Zestawienie stanowisk'!$B$5:$E$65,4,FALSE)),\"-\")","v":1},{"$f":"IFERROR(((C220-(VLOOKUP(E220,'Siatka płac'!$B$6:$E$17,3,FALSE)))/(VLOOKUP(E220,'Siatka płac'!$B$6:$E$17,4,FALSE)-VLOOKUP(E220,'Siatka płac'!$B$6:$E$17,3,FALSE))),\"-\")","v":2},"powyżej maks.",{"$f":"IF(G220=\"poniżej min.\",((VLOOKUP(E220,'Siatka płac'!$B$6:$D$17,3,FALSE)-C220)*(13-'Zestawienie stanowisk'!$H$1)),\"-\")","v":"-"}]
[1,"Specjalista ds. księgowych",5500,"Pracownik 217",{"$f":"IFERROR((VLOOKUP(B221,'Zestawienie stanowisk'!$B$5:$E$65,4,FALSE)),\"-\")","v":1},{"$f":"IFERROR(((C221-(VLOOKUP(E221,'Siatka płac'!$B$6:$E$17,3,FALSE)))/(VLOOKUP(E221,'Siatka płac'!$B$6:$E$17,4,FALSE)-VLOOKUP(E221,'Siatka płac'!$B$6:$E$17,3,FALSE))),\"-\")","v":1.75},"powyżej maks.",{"$f":"IF(G221=\"poniżej min.\",((VLOOKUP(E221,'Siatka płac'!$B$6:$D$17,3,FALSE)-C221)*(13-'Zestawienie stanowisk'!$H$1)),\"-\")","v":"-"}]
[1,"Specjalista ds. księgowych",5800,"Pracownik 218",{"$f":"IFERROR((VLOOKUP(B222,'Zestawienie stanowisk'!$B$5:$E$65,4,FALSE)),\"-\")","v":1},{"$f":"IFERROR(((C222-(VLOOKUP(E222,'Siatka płac'!$B$6:$E$17,3,FALSE)))/(VLOOKUP(E222,'Siatka płac'!$B$6:$E$17,4,FALSE)-VLOOKUP(E222,'Siatka płac'!$B$6:$E$17,3,FALSE))),\"-\")","v":1.9},"powyżej maks.",{"$f":"IF(G222=\"poniżej min.\",((VLOOKUP(E222,'Siatka płac'!$B$6:$D$17,3,FALSE)-C222)*(13-'Zestawienie stanowisk'!$H$1)),\"-\")","v":"-"}]
[1,"Specjalista ds. księgowych",5900,"Pracownik 219",{"$f":"IFERROR((VLOOKUP(B223,'Zestawienie stanowisk'!$B$5:$E$65,4,FALSE)),\"-\")","v":1},{"$f":"IFERROR(((C223-(VLOOKUP(E223,'Siatka płac'!$B$6:$E$17,3,FALSE)))/(VLOOKUP(E223,'Siatka płac'!$B$6:$E$17,4,FALSE)-VLOOKUP(E223,'Siatka płac'!$B$6:$E$17,3,FALSE))),\"-\")","v":1.95},"powyżej maks.",{"$f":"IF(G223=\"poniżej min.\",((VLOOKUP(E223,'Siatka płac'!$B$6:$D$17,3,FALSE)-C223)*(13-'Zestawienie stanowisk'!$H$1)),\"-\")","v":"-"}]
[1,"Specjalista ds. księgowych",6500,"Pracownik 220",{"$f":"IFERROR((VLOOKUP(B224,'Zestawienie stanowisk'!$B$5:$E$65,4,FALSE)),\"-\")","v":1},{"$f":"IFERROR(((C224-(VLOOKUP(E224,'Siatka płac'!$B$6:$E$17,3,FALSE)))/(VLOOKUP(E224,'Siatka płac'!$B$6:$E$17,4,FALSE)-VLOOKUP(E224,'Siatka płac'!$B$6:$E$17,3,FALSE))),\"-\")","v":2.25},"powyżej maks.",{"$f":"IF(G224=\"poniżej min.\",((VLOOKUP(E224,'Siatka płac'!$B$6:$D$17,3,FALSE)-C224)*(13-'Zestawienie stanowisk'!$H$1)),\"-\")","v":"-"}]
[1,"Specjalista ds. księgowych",4500,"Pracownik 221",{"$f":"IFERROR((VLOOKUP(B225,'Zestawienie stanowisk'!$B$5:$E$65,4,FALSE)),\"-\")","v":1},{"$f":"IFERROR(((C225-(VLOOKUP(E225,'Siatka płac'!$B$6:$E$17,3,FALSE)))/(VLOOKUP(E225,'Siatka płac'!$B$6:$E$17,4,FALSE)-VLOOKUP(E225,'Siatka płac'!$B$6:$E$17,3,FALSE))),\"-\")","v":1.25},"powyżej maks.",{"$f":"IF(G225=\"poniżej min.\",((VLOOKUP(E225,'Siatka płac'!$B$6:$D$17,3,FALSE)-C225)*(13-'Zestawienie stanowisk'!$H$1)),\"-\")","v":"-"}]
[1,"Specjalista ds. personalnych",8000,"Pracownik 222",{"$f":"IFERROR((VLOOKUP(B226,'Zestawienie stanowisk'!$B$5:$E$65,4,FALSE)),\"-\")","v":1},{"$f":"IFERROR(((C226-(VLOOKUP(E226,'Siatka płac'!$B$6:$E$17,3,FALSE)))/(VLOOKUP(E226,'Siatka płac'!$B$6:$E$17,4,FALSE)-VLOOKUP(E226,'Siatka płac'!$B$6:$E$17,3,FALSE))),\"-\")","v":3},"powyżej maks.",{"$f":"IF(G226=\"poniżej min.\",((VLOOKUP(E226,'Siatka płac'!$B$6:$D$17,3,FALSE)-C226)*(13-'Zestawienie stanowisk'!$H$1)),\"-\")","v":"-"}]
[1,"Specjalista ds. personalnych",6500,"Pracownik 223",{"$f":"IFERROR((VLOOKUP(B227,'Zestawienie stanowisk'!$B$5:$E$65,4,FALSE)),\"-\")","v":1},{"$f":"IFERROR(((C227-(VLOOKUP(E227,'Siatka płac'!$B$6:$E$17,3,FALSE)))/(VLOOKUP(E227,'Siatka płac'!$B$6:$E$17,4,FALSE)-VLOOKUP(E227,'Siatka płac'!$B$6:$E$17,3,FALSE))),\"-\")","v":2.25},"powyżej maks.",{"$f":"IF(G227=\"poniżej min.\",((VLOOKUP(E227,'Siatka płac'!$B$6:$D$17,3,FALSE)-C227)*(13-'Zestawienie stanowisk'!$H$1)),\"-\")","v":"-"}]
[1,"Specjalista ds. personalnych",5900,"Pracownik 224",{"$f":"IFERROR((VLOOKUP(B228,'Zestawienie stanowisk'!$B$5:$E$65,4,FALSE)),\"-\")","v":1},{"$f":"IFERROR(((C228-(VLOOKUP(E228,'Siatka płac'!$B$6:$E$17,3,FALSE)))/(VLOOKUP(E228,'Siatka płac'!$B$6:$E$17,4,FALSE)-VLOOKUP(E228,'Siatka płac'!$B$6:$E$17,3,FALSE))),\"-\")","v":1.95},"powyżej maks.",{"$f":"IF(G228=\"poniżej min.\",((VLOOKUP(E228,'Siatka płac'!$B$6:$D$17,3,FALSE)-C228)*(13-'Zestawienie stanowisk'!$H$1)),\"-\")","v":"-"}]
[1,"Specjalista ds. personalnych",5900,"Pracownik 225",{"$f":"IFERROR((VLOOKUP(B229,'Zestawienie stanowisk'!$B$5:$E$65,4,FALSE)),\"-\")","v":1},{"$f":"IFERROR(((C229-(VLOOKUP(E229,'Siatka płac'!$B$6:$E$17,3,FALSE)))/(VLOOKUP(E229,'Siatka płac'!$B$6:$E$17,4,FALSE)-VLOOKUP(E229,'Siatka płac'!$B$6:$E$17,3,FALSE))),\"-\")","v":1.95},"powyżej maks.",{"$f":"IF(G229=\"poniżej min.\",((VLOOKUP(E229,'Siatka płac'!$B$6:$D$17,3,FALSE)-C229)*(13-'Zestawienie stanowisk'!$H$1)),\"-\")","v":"-"}]
[1,"Specjalista ds. personalnych",4000,"Pracownik 226",{"$f":"IFERROR((VLOOKUP(B230,'Zestawienie stanowisk'!$B$5:$E$65,4,FALSE)),\"-\")","v":1},{"$f":"IFERROR(((C230-(VLOOKUP(E230,'Siatka płac'!$B$6:$E$17,3,FALSE)))/(VLOOKUP(E230,'Siatka płac'!$B$6:$E$17,4,FALSE)-VLOOKUP(E230,'Siatka płac'!$B$6:$E$17,3,FALSE))),\"-\")","v":1},"IV",{"$f":"IF(G230=\"poniżej min.\",((VLOOKUP(E230,'Siatka płac'!$B$6:$D$17,3,FALSE)-C230)*(13-'Zestawienie stanowisk'!$H$1)),\"-\")","v":"-"}]
[1,"Monter",2500,"Pracownik 227",{"$f":"IFERROR((VLOOKUP(B231,'Zestawienie stanowisk'!$B$5:$E$65,4,FALSE)),\"-\")","v":1},{"$f":"IFERROR(((C231-(VLOOKUP(E231,'Siatka płac'!$B$6:$E$17,3,FALSE)))/(VLOOKUP(E231,'Siatka płac'!$B$6:$E$17,4,FALSE)-VLOOKUP(E231,'Siatka płac'!$B$6:$E$17,3,FALSE))),\"-\")","v":0.25},"I",{"$f":"IF(G231=\"poniżej min.\",((VLOOKUP(E231,'Siatka płac'!$B$6:$D$17,3,FALSE)-C231)*(13-'Zestawienie stanowisk'!$H$1)),\"-\")","v":"-"}]
[1,"Monter",2500,"Pracownik 228",{"$f":"IFERROR((VLOOKUP(B232,'Zestawienie stanowisk'!$B$5:$E$65,4,FALSE)),\"-\")","v":1},{"$f":"IFERROR(((C232-(VLOOKUP(E232,'Siatka płac'!$B$6:$E$17,3,FALSE)))/(VLOOKUP(E232,'Siatka płac'!$B$6:$E$17,4,FALSE)-VLOOKUP(E232,'Siatka płac'!$B$6:$E$17,3,FALSE))),\"-\")","v":0.25},"I",{"$f":"IF(G232=\"poniżej min.\",((VLOOKUP(E232,'Siatka płac'!$B$6:$D$17,3,FALSE)-C232)*(13-'Zestawienie stanowisk'!$H$1)),\"-\")","v":"-"}]
[1,"Monter",2500,"Pracownik 229",{"$f":"IFERROR((VLOOKUP(B233,'Zestawienie stanowisk'!$B$5:$E$65,4,FALSE)),\"-\")","v":1},{"$f":"IFERROR(((C233-(VLOOKUP(E233,'Siatka płac'!$B$6:$E$17,3,FALSE)))/(VLOOKUP(E233,'Siatka płac'!$B$6:$E$17,4,FALSE)-VLOOKUP(E233,'Siatka płac'!$B$6:$E$17,3,FALSE))),\"-\")","v":0.25},"I",{"$f":"IF(G233=\"poniżej min.\",((VLOOKUP(E233,'Siatka płac'!$B$6:$D$17,3,FALSE)-C233)*(13-'Zestawienie stanowisk'!$H$1)),\"-\")","v":"-"}]
[1,"Monter",2500,"Pracownik 230",{"$f":"IFERROR((VLOOKUP(B234,'Zestawienie stanowisk'!$B$5:$E$65,4,FALSE)),\"-\")","v":1},{"$f":"IFERROR(((C234-(VLOOKUP(E234,'Siatka płac'!$B$6:$E$17,3,FALSE)))/(VLOOKUP(E234,'Siatka płac'!$B$6:$E$17,4,FALSE)-VLOOKUP(E234,'Siatka płac'!$B$6:$E$17,3,FALSE))),\"-\")","v":0.25},"I",{"$f":"IF(G234=\"poniżej min.\",((VLOOKUP(E234,'Siatka płac'!$B$6:$D$17,3,FALSE)-C234)*(13-'Zestawienie stanowisk'!$H$1)),\"-\")","v":"-"}]
[1,"Mistrz",5700,"Pracownik 231",{"$f":"IFERROR((VLOOKUP(B235,'Zestawienie stanowisk'!$B$5:$E$65,4,FALSE)),\"-\")","v":1},{"$f":"IFERROR(((C235-(VLOOKUP(E235,'Siatka płac'!$B$6:$E$17,3,FALSE)))/(VLOOKUP(E235,'Siatka płac'!$B$6:$E$17,4,FALSE)-VLOOKUP(E235,'Siatka płac'!$B$6:$E$17,3,FALSE))),\"-\")","v":1.85},"powyżej maks.",{"$f":"IF(G235=\"poniżej min.\",((VLOOKUP(E235,'Siatka płac'!$B$6:$D$17,3,FALSE)-C235)*(13-'Zestawienie stanowisk'!$H$1)),\"-\")","v":"-"}]
[1,"Mistrz",4500,"Pracownik 232",{"$f":"IFERROR((VLOOKUP(B236,'Zestawienie stanowisk'!$B$5:$E$65,4,FALSE)),\"-\")","v":1},{"$f":"IFERROR(((C236-(VLOOKUP(E236,'Siatka płac'!$B$6:$E$17,3,FALSE)))/(VLOOKUP(E236,'Siatka płac'!$B$6:$E$17,4,FALSE)-VLOOKUP(E236,'Siatka płac'!$B$6:$E$17,3,FALSE))),\"-\")","v":1.25},"powyżej maks.",{"$f":"IF(G236=\"poniżej min.\",((VLOOKUP(E236,'Siatka płac'!$B$6:$D$17,3,FALSE)-C236)*(13-'Zestawienie stanowisk'!$H$1)),\"-\")","v":"-"}]
[1,"Mistrz",4700,"Pracownik 233",{"$f":"IFERROR((VLOOKUP(B237,'Zestawienie stanowisk'!$B$5:$E$65,4,FALSE)),\"-\")","v":1},{"$f":"IFERROR(((C237-(VLOOKUP(E237,'Siatka płac'!$B$6:$E$17,3,FALSE)))/(VLOOKUP(E237,'Siatka płac'!$B$6:$E$17,4,FALSE)-VLOOKUP(E237,'Siatka płac'!$B$6:$E$17,3,FALSE))),\"-\")","v":1.35},"powyżej maks.",{"$f":"IF(G237=\"poniżej min.\",((VLOOKUP(E237,'Siatka płac'!$B$6:$D$17,3,FALSE)-C237)*(13-'Zestawienie stanowisk'!$H$1)),\"-\")","v":"-"}]
[1,"Mistrz",6000,"Pracownik 234",{"$f":"IFERROR((VLOOKUP(B238,'Zestawienie stanowisk'!$B$5:$E$65,4,FALSE)),\"-\")","v":1},{"$f":"IFERROR(((C238-(VLOOKUP(E238,'Siatka płac'!$B$6:$E$17,3,FALSE)))/(VLOOKUP(E238,'Siatka płac'!$B$6:$E$17,4,FALSE)-VLOOKUP(E238,'Siatka płac'!$B$6:$E$17,3,FALSE))),\"-\")","v":2},"powyżej maks.",{"$f":"IF(G238=\"poniżej min.\",((VLOOKUP(E238,'Siatka płac'!$B$6:$D$17,3,FALSE)-C238)*(13-'Zestawienie stanowisk'!$H$1)),\"-\")","v":"-"}]
[1,"Mistrz",5400,"Pracownik 235",{"$f":"IFERROR((VLOOKUP(B239,'Zestawienie stanowisk'!$B$5:$E$65,4,FALSE)),\"-\")","v":1},{"$f":"IFERROR(((C239-(VLOOKUP(E239,'Siatka płac'!$B$6:$E$17,3,FALSE)))/(VLOOKUP(E239,'Siatka płac'!$B$6:$E$17,4,FALSE)-VLOOKUP(E239,'Siatka płac'!$B$6:$E$17,3,FALSE))),\"-\")","v":1.7},"powyżej maks.",{"$f":"IF(G239=\"poniżej min.\",((VLOOKUP(E239,'Siatka płac'!$B$6:$D$17,3,FALSE)-C239)*(13-'Zestawienie stanowisk'!$H$1)),\"-\")","v":"-"}]
[1,"Mistrz",5300,"Pracownik 236",{"$f":"IFERROR((VLOOKUP(B240,'Zestawienie stanowisk'!$B$5:$E$65,4,FALSE)),\"-\")","v":1},{"$f":"IFERROR(((C240-(VLOOKUP(E240,'Siatka płac'!$B$6:$E$17,3,FALSE)))/(VLOOKUP(E240,'Siatka płac'!$B$6:$E$17,4,FALSE)-VLOOKUP(E240,'Siatka płac'!$B$6:$E$17,3,FALSE))),\"-\")","v":1.65},"powyżej maks.",{"$f":"IF(G240=\"poniżej min.\",((VLOOKUP(E240,'Siatka płac'!$B$6:$D$17,3,FALSE)-C240)*(13-'Zestawienie stanowisk'!$H$1)),\"-\")","v":"-"}]
[1,"Mistrz",4900,"Pracownik 237",{"$f":"IFERROR((VLOOKUP(B241,'Zestawienie stanowisk'!$B$5:$E$65,4,FALSE)),\"-\")","v":1},{"$f":"IFERROR(((C241-(VLOOKUP(E241,'Siatka płac'!$B$6:$E$17,3,FALSE)))/(VLOOKUP(E241,'Siatka płac'!$B$6:$E$17,4,FALSE)-VLOOKUP(E241,'Siatka płac'!$B$6:$E$17,3,FALSE))),\"-\")","v":1.45},"powyżej maks.",{"$f":"IF(G241=\"poniżej min.\",((VLOOKUP(E241,'Siatka płac'!$B$6:$D$17,3,FALSE)-C241)*(13-'Zestawienie stanowisk'!$H$1)),\"-\")","v":"-"}]
[1,"Mistrz",4900,"Pracownik 238",{"$f":"IFERROR((VLOOKUP(B242,'Zestawienie stanowisk'!$B$5:$E$65,4,FALSE)),\"-\")","v":1},{"$f":"IFERROR(((C242-(VLOOKUP(E242,'Siatka płac'!$B$6:$E$17,3,FALSE)))/(VLOOKUP(E242,'Siatka płac'!$B$6:$E$17,4,FALSE)-VLOOKUP(E242,'Siatka płac'!$B$6:$E$17,3,FALSE))),\"-\")","v":1.45},"powyżej maks.",{"$f":"IF(G242=\"poniżej min.\",((VLOOKUP(E242,'Siatka płac'!$B$6:$D$17,3,FALSE)-C242)*(13-'Zestawienie stanowisk'!$H$1)),\"-\")","v":"-"}]
[1,"Mistrz",5050,"Pracownik 239",{"$f":"IFERROR((VLOOKUP(B243,'Zestawienie stanowisk'!$B$5:$E$65,4,FALSE)),\"-\")","v":1},{"$f":"IFERROR(((C243-(VLOOKUP(E243,'Siatka płac'!$B$6:$E$17,3,FALSE)))/(VLOOKUP(E243,'Siatka płac'!$B$6:$E$17,4,FALSE)-VLOOKUP(E243,'Siatka płac'!$B$6:$E$17,3,FALSE))),\"-\")","v":1.5249999999999999},"powyżej maks.",{"$f":"IF(G243=\"poniżej min.\",((VLOOKUP(E243,'Siatka płac'!$B$6:$D$17,3,FALSE)-C243)*(13-'Zestawienie stanowisk'!$H$1)),\"-\")","v":"-"}]
[1,"Specjalista ds. planowania",4000,"Pracownik 240",{"$f":"IFERROR((VLOOKUP(B244,'Zestawienie stanowisk'!$B$5:$E$65,4,FALSE)),\"-\")","v":1},{"$f":"IFERROR(((C244-(VLOOKUP(E244,'Siatka płac'!$B$6:$E$17,3,FALSE)))/(VLOOKUP(E244,'Siatka płac'!$B$6:$E$17,4,FALSE)-VLOOKUP(E244,'Siatka płac'!$B$6:$E$17,3,FALSE))),\"-\")","v":1},"IV",{"$f":"IF(G244=\"poniżej min.\",((VLOOKUP(E244,'Siatka płac'!$B$6:$D$17,3,FALSE)-C244)*(13-'Zestawienie stanowisk'!$H$1)),\"-\")","v":"-"}]
[1,"Specjalista ds. planowania",4500,"Pracownik 241",{"$f":"IFERROR((VLOOKUP(B245,'Zestawienie stanowisk'!$B$5:$E$65,4,FALSE)),\"-\")","v":1},{"$f":"IFERROR(((C245-(VLOOKUP(E245,'Siatka płac'!$B$6:$E$17,3,FALSE)))/(VLOOKUP(E245,'Siatka płac'!$B$6:$E$17,4,FALSE)-VLOOKUP(E245,'Siatka płac'!$B$6:$E$17,3,FALSE))),\"-\")","v":1.25},"powyżej maks.",{"$f":"IF(G245=\"poniżej min.\",((VLOOKUP(E245,'Siatka płac'!$B$6:$D$17,3,FALSE)-C245)*(13-'Zestawienie stanowisk'!$H$1)),\"-\")","v":"-"}]
[1,"Specjalista ds. planowania",5100,"Pracownik 242",{"$f":"IFERROR((VLOOKUP(B246,'Zestawienie stanowisk'!$B$5:$E$65,4,FALSE)),\"-\")","v":1},{"$f":"IFERROR(((C246-(VLOOKUP(E246,'Siatka płac'!$B$6:$E$17,3,FALSE)))/(VLOOKUP(E246,'Siatka płac'!$B$6:$E$17,4,FALSE)-VLOOKUP(E246,'Siatka płac'!$B$6:$E$17,3,FALSE))),\"-\")","v":1.55},"powyżej maks.",{"$f":"IF(G246=\"poniżej min.\",((VLOOKUP(E246,'Siatka płac'!$B$6:$D$17,3,FALSE)-C246)*(13-'Zestawienie stanowisk'!$H$1)),\"-\")","v":"-"}]
[1,"Specjalista ds. planowania",5700,"Pracownik 243",{"$f":"IFERROR((VLOOKUP(B247,'Zestawienie stanowisk'!$B$5:$E$65,4,FALSE)),\"-\")","v":1},{"$f":"IFERROR(((C247-(VLOOKUP(E247,'Siatka płac'!$B$6:$E$17,3,FALSE)))/(VLOOKUP(E247,'Siatka płac'!$B$6:$E$17,4,FALSE)-VLOOKUP(E247,'Siatka płac'!$B$6:$E$17,3,FALSE))),\"-\")","v":1.85},"powyżej maks.",{"$f":"IF(G247=\"poniżej min.\",((VLOOKUP(E247,'Siatka płac'!$B$6:$D$17,3,FALSE)-C247)*(13-'Zestawienie stanowisk'!$H$1)),\"-\")","v":"-"}]
[1,"Monter",2500,"Pracownik 244",{"$f":"IFERROR((VLOOKUP(B248,'Zestawienie stanowisk'!$B$5:$E$65,4,FALSE)),\"-\")","v":1},{"$f":"IFERROR(((C248-(VLOOKUP(E248,'Siatka płac'!$B$6:$E$17,3,FALSE)))/(VLOOKUP(E248,'Siatka płac'!$B$6:$E$17,4,FALSE)-VLOOKUP(E248,'Siatka płac'!$B$6:$E$17,3,FALSE))),\"-\")","v":0.25},"I",{"$f":"IF(G248=\"poniżej min.\",((VLOOKUP(E248,'Siatka płac'!$B$6:$D$17,3,FALSE)-C248)*(13-'Zestawienie stanowisk'!$H$1)),\"-\")","v":"-"}]
[1,"Monter",2500,"Pracownik 245",{"$f":"IFERROR((VLOOKUP(B249,'Zestawienie stanowisk'!$B$5:$E$65,4,FALSE)),\"-\")","v":1},{"$f":"IFERROR(((C249-(VLOOKUP(E249,'Siatka płac'!$B$6:$E$17,3,FALSE)))/(VLOOKUP(E249,'Siatka płac'!$B$6:$E$17,4,FALSE)-VLOOKUP(E249,'Siatka płac'!$B$6:$E$17,3,FALSE))),\"-\")","v":0.25},"I",{"$f":"IF(G249=\"poniżej min.\",((VLOOKUP(E249,'Siatka płac'!$B$6:$D$17,3,FALSE)-C249)*(13-'Zestawienie stanowisk'!$H$1)),\"-\")","v":"-"}]
[1,"Monter",2500,"Pracownik 246",{"$f":"IFERROR((VLOOKUP(B250,'Zestawienie stanowisk'!$B$5:$E$65,4,FALSE)),\"-\")","v":1},{"$f":"IFERROR(((C250-(VLOOKUP(E250,'Siatka płac'!$B$6:$E$17,3,FALSE)))/(VLOOKUP(E250,'Siatka płac'!$B$6:$E$17,4,FALSE)-VLOOKUP(E250,'Siatka płac'!$B$6:$E$17,3,FALSE))),\"-\")","v":0.25},"I",{"$f":"IF(G250=\"poniżej min.\",((VLOOKUP(E250,'Siatka płac'!$B$6:$D$17,3,FALSE)-C250)*(13-'Zestawienie stanowisk'!$H$1)),\"-\")","v":"-"}]
[1,"Administrator serwerów",7000,"Pracownik 247",{"$f":"IFERROR((VLOOKUP(B251,'Zestawienie stanowisk'!$B$5:$E$65,4,FALSE)),\"-\")","v":1},{"$f":"IFERROR(((C251-(VLOOKUP(E251,'Siatka płac'!$B$6:$E$17,3,FALSE)))/(VLOOKUP(E251,'Siatka płac'!$B$6:$E$17,4,FALSE)-VLOOKUP(E251,'Siatka płac'!$B$6:$E$17,3,FALSE))),\"-\")","v":2.5},"powyżej maks.",{"$f":"IF(G251=\"poniżej min.\",((VLOOKUP(E251,'Siatka płac'!$B$6:$D$17,3,FALSE)-C251)*(13-'Zestawienie stanowisk'!$H$1)),\"-\")","v":"-"}]
[1,"Administrator serwerów",5500,"Pracownik 248",{"$f":"IFERROR((VLOOKUP(B252,'Zestawienie stanowisk'!$B$5:$E$65,4,FALSE)),\"-\")","v":1},{"$f":"IFERROR(((C252-(VLOOKUP(E252,'Siatka płac'!$B$6:$E$17,3,FALSE)))/(VLOOKUP(E252,'Siatka płac'!$B$6:$E$17,4,FALSE)-VLOOKUP(E252,'Siatka płac'!$B$6:$E$17,3,FALSE))),\"-\")","v":1.75},"powyżej maks.",{"$f":"IF(G252=\"poniżej min.\",((VLOOKUP(E252,'Siatka płac'!$B$6:$D$17,3,FALSE)-C252)*(13-'Zestawienie stanowisk'!$H$1)),\"-\")","v":"-"}]
[1,"Monter",2500,"Pracownik 249",{"$f":"IFERROR((VLOOKUP(B253,'Zestawienie stanowisk'!$B$5:$E$65,4,FALSE)),\"-\")","v":1},{"$f":"IFERROR(((C253-(VLOOKUP(E253,'Siatka płac'!$B$6:$E$17,3,FALSE)))/(VLOOKUP(E253,'Siatka płac'!$B$6:$E$17,4,FALSE)-VLOOKUP(E253,'Siatka płac'!$B$6:$E$17,3,FALSE))),\"-\")","v":0.25},"I",{"$f":"IF(G253=\"poniżej min.\",((VLOOKUP(E253,'Siatka płac'!$B$6:$D$17,3,FALSE)-C253)*(13-'Zestawienie stanowisk'!$H$1)),\"-\")","v":"-"}]
[1,"Elektryk",3500,"Pracownik 250",{"$f":"IFERROR((VLOOKUP(B254,'Zestawienie stanowisk'!$B$5:$E$65,4,FALSE)),\"-\")","v":1},{"$f":"IFERROR(((C254-(VLOOKUP(E254,'Siatka płac'!$B$6:$E$17,3,FALSE)))/(VLOOKUP(E254,'Siatka płac'!$B$6:$E$17,4,FALSE)-VLOOKUP(E254,'Siatka płac'!$B$6:$E$17,3,FALSE))),\"-\")","v":0.75},"III",{"$f":"IF(G254=\"poniżej min.\",((VLOOKUP(E254,'Siatka płac'!$B$6:$D$17,3,FALSE)-C254)*(13-'Zestawienie stanowisk'!$H$1)),\"-\")","v":"-"}]
[1,"Elektryk",3800,"Pracownik 251",{"$f":"IFERROR((VLOOKUP(B255,'Zestawienie stanowisk'!$B$5:$E$65,4,FALSE)),\"-\")","v":1},{"$f":"IFERROR(((C255-(VLOOKUP(E255,'Siatka płac'!$B$6:$E$17,3,FALSE)))/(VLOOKUP(E255,'Siatka płac'!$B$6:$E$17,4,FALSE)-VLOOKUP(E255,'Siatka płac'!$B$6:$E$17,3,FALSE))),\"-\")","v":0.9},"IV",{"$f":"IF(G255=\"poniżej min.\",((VLOOKUP(E255,'Siatka płac'!$B$6:$D$17,3,FALSE)-C255)*(13-'Zestawienie stanowisk'!$H$1)),\"-\")","v":"-"}]
[1,"Elektryk",4200,"Pracownik 252",{"$f":"IFERROR((VLOOKUP(B256,'Zestawienie stanowisk'!$B$5:$E$65,4,FALSE)),\"-\")","v":1},{"$f":"IFERROR(((C256-(VLOOKUP(E256,'Siatka płac'!$B$6:$E$17,3,FALSE)))/(VLOOKUP(E256,'Siatka płac'!$B$6:$E$17,4,FALSE)-VLOOKUP(E256,'Siatka płac'!$B$6:$E$17,3,FALSE))),\"-\")","v":1.1000000000000001},"powyżej maks.",{"$f":"IF(G256=\"poniżej min.\",((VLOOKUP(E256,'Siatka płac'!$B$6:$D$17,3,FALSE)-C256)*(13-'Zestawienie stanowisk'!$H$1)),\"-\")","v":"-"}]
[1,"Elektryk",4500,"Pracownik 253",{"$f":"IFERROR((VLOOKUP(B257,'Zestawienie stanowisk'!$B$5:$E$65,4,FALSE)),\"-\")","v":1},{"$f":"IFERROR(((C257-(VLOOKUP(E257,'Siatka płac'!$B$6:$E$17,3,FALSE)))/(VLOOKUP(E257,'Siatka płac'!$B$6:$E$17,4,FALSE)-VLOOKUP(E257,'Siatka płac'!$B$6:$E$17,3,FALSE))),\"-\")","v":1.25},"powyżej maks.",{"$f":"IF(G257=\"poniżej min.\",((VLOOKUP(E257,'Siatka płac'!$B$6:$D$17,3,FALSE)-C257)*(13-'Zestawienie stanowisk'!$H$1)),\"-\")","v":"-"}]
[1,"Elektryk",4000,"Pracownik 254",{"$f":"IFERROR((VLOOKUP(B258,'Zestawienie stanowisk'!$B$5:$E$65,4,FALSE)),\"-\")","v":1},{"$f":"IFERROR(((C258-(VLOOKUP(E258,'Siatka płac'!$B$6:$E$17,3,FALSE)))/(VLOOKUP(E258,'Siatka płac'!$B$6:$E$17,4,FALSE)-VLOOKUP(E258,'Siatka płac'!$B$6:$E$17,3,FALSE))),\"-\")","v":1},"IV",{"$f":"IF(G258=\"poniżej min.\",((VLOOKUP(E258,'Siatka płac'!$B$6:$D$17,3,FALSE)-C258)*(13-'Zestawienie stanowisk'!$H$1)),\"-\")","v":"-"}]
[1,"Elektryk",5000,"Pracownik 255",{"$f":"IFERROR((VLOOKUP(B259,'Zestawienie stanowisk'!$B$5:$E$65,4,FALSE)),\"-\")","v":1},{"$f":"IFERROR(((C259-(VLOOKUP(E259,'Siatka płac'!$B$6:$E$17,3,FALSE)))/(VLOOKUP(E259,'Siatka płac'!$B$6:$E$17,4,FALSE)-VLOOKUP(E259,'Siatka płac'!$B$6:$E$17,3,FALSE))),\"-\")","v":1.5},"powyżej maks.",{"$f":"IF(G259=\"poniżej min.\",((VLOOKUP(E259,'Siatka płac'!$B$6:$D$17,3,FALSE)-C259)*(13-'Zestawienie stanowisk'!$H$1)),\"-\")","v":"-"}]
[1,"Monter",2800,"Pracownik 256",{"$f":"IFERROR((VLOOKUP(B260,'Zestawienie stanowisk'!$B$5:$E$65,4,FALSE)),\"-\")","v":1},{"$f":"IFERROR(((C260-(VLOOKUP(E260,'Siatka płac'!$B$6:$E$17,3,FALSE)))/(VLOOKUP(E260,'Siatka płac'!$B$6:$E$17,4,FALSE)-VLOOKUP(E260,'Siatka płac'!$B$6:$E$17,3,FALSE))),\"-\")","v":0.4},"II",{"$f":"IF(G260=\"poniżej min.\",((VLOOKUP(E260,'Siatka płac'!$B$6:$D$17,3,FALSE)-C260)*(13-'Zestawienie stanowisk'!$H$1)),\"-\")","v":"-"}]
[{"$f":"IF(ISBLANK(B261),0,1)","v":1},"Monter",2800,"Pracownik 257",{"$f":"IFERROR((VLOOKUP(B261,'Zestawienie stanowisk'!$B$5:$E$65,4,FALSE)),\"-\")","v":1},{"$f":"IFERROR(((C261-(VLOOKUP(E261,'Siatka płac'!$B$6:$E$17,3,FALSE)))/(VLOOKUP(E261,'Siatka płac'!$B$6:$E$17,4,FALSE)-VLOOKUP(E261,'Siatka płac'!$B$6:$E$17,3,FALSE))),\"-\")","v":0.4},{"$f":"IFERROR((INDEX($N$5:$N$10,MATCH(F261,$M$5:$M$10,-1))),\"-\")","v":"II"},{"$f":"IF(G261=\"poniżej min.\",((VLOOKUP(E261,'Siatka płac'!$B$6:$D$17,3,FALSE)-C261)*(13-'Zestawienie stanowisk'!$H$1)),\"-\")","v":"-"}]
[1,"Monter",2800,"Pracownik 258",{"$f":"IFERROR((VLOOKUP(B262,'Zestawienie stanowisk'!$B$5:$E$65,4,FALSE)),\"-\")","v":1},{"$f":"IFERROR(((C262-(VLOOKUP(E262,'Siatka płac'!$B$6:$E$17,3,FALSE)))/(VLOOKUP(E262,'Siatka płac'!$B$6:$E$17,4,FALSE)-VLOOKUP(E262,'Siatka płac'!$B$6:$E$17,3,FALSE))),\"-\")","v":0.4},"II",{"$f":"IF(G262=\"poniżej min.\",((VLOOKUP(E262,'Siatka płac'!$B$6:$D$17,3,FALSE)-C262)*(13-'Zestawienie stanowisk'!$H$1)),\"-\")","v":"-"}]
[1,"Monter",2800,"Pracownik 259",{"$f":"IFERROR((VLOOKUP(B263,'Zestawienie stanowisk'!$B$5:$E$65,4,FALSE)),\"-\")","v":1},{"$f":"IFERROR(((C263-(VLOOKUP(E263,'Siatka płac'!$B$6:$E$17,3,FALSE)))/(VLOOKUP(E263,'Siatka płac'!$B$6:$E$17,4,FALSE)-VLOOKUP(E263,'Siatka płac'!$B$6:$E$17,3,FALSE))),\"-\")","v":0.4},"II",{"$f":"IF(G263=\"poniżej min.\",((VLOOKUP(E263,'Siatka płac'!$B$6:$D$17,3,FALSE)-C263)*(13-'Zestawienie stanowisk'!$H$1)),\"-\")","v":"-"}]
[1,"Monter",2800,"Pracownik 260",{"$f":"IFERROR((VLOOKUP(B264,'Zestawienie stanowisk'!$B$5:$E$65,4,FALSE)),\"-\")","v":1},{"$f":"IFERROR(((C264-(VLOOKUP(E264,'Siatka płac'!$B$6:$E$17,3,FALSE)))/(VLOOKUP(E264,'Siatka płac'!$B$6:$E$17,4,FALSE)-VLOOKUP(E264,'Siatka płac'!$B$6:$E$17,3,FALSE))),\"-\")","v":0.4},"II",{"$f":"IF(G264=\"poniżej min.\",((VLOOKUP(E264,'Siatka płac'!$B$6:$D$17,3,FALSE)-C264)*(13-'Zestawienie stanowisk'!$H$1)),\"-\")","v":"-"}]
[1,"Monter",2800,"Pracownik 261",{"$f":"IFERROR((VLOOKUP(B265,'Zestawienie stanowisk'!$B$5:$E$65,4,FALSE)),\"-\")","v":1},{"$f":"IFERROR(((C265-(VLOOKUP(E265,'Siatka płac'!$B$6:$E$17,3,FALSE)))/(VLOOKUP(E265,'Siatka płac'!$B$6:$E$17,4,FALSE)-VLOOKUP(E265,'Siatka płac'!$B$6:$E$17,3,FALSE))),\"-\")","v":0.4},"II",{"$f":"IF(G265=\"poniżej min.\",((VLOOKUP(E265,'Siatka płac'!$B$6:$D$17,3,FALSE)-C265)*(13-'Zestawienie stanowisk'!$H$1)),\"-\")","v":"-"}]
[1,"Monter",2800,"Pracownik 262",{"$f":"IFERROR((VLOOKUP(B266,'Zestawienie stanowisk'!$B$5:$E$65,4,FALSE)),\"-\")","v":1},{"$f":"IFERROR(((C266-(VLOOKUP(E266,'Siatka płac'!$B$6:$E$17,3,FALSE)))/(VLOOKUP(E266,'Siatka płac'!$B$6:$E$17,4,FALSE)-VLOOKUP(E266,'Siatka płac'!$B$6:$E$17,3,FALSE))),\"-\")","v":0.4},"II",{"$f":"IF(G266=\"poniżej min.\",((VLOOKUP(E266,'Siatka płac'!$B$6:$D$17,3,FALSE)-C266)*(13-'Zestawienie stanowisk'!$H$1)),\"-\")","v":"-"}]
[1,"Monter",2800,"Pracownik 263",{"$f":"IFERROR((VLOOKUP(B267,'Zestawienie stanowisk'!$B$5:$E$65,4,FALSE)),\"-\")","v":1},{"$f":"IFERROR(((C267-(VLOOKUP(E267,'Siatka płac'!$B$6:$E$17,3,FALSE)))/(VLOOKUP(E267,'Siatka płac'!$B$6:$E$17,4,FALSE)-VLOOKUP(E267,'Siatka płac'!$B$6:$E$17,3,FALSE))),\"-\")","v":0.4},"II",{"$f":"IF(G267=\"poniżej min.\",((VLOOKUP(E267,'Siatka płac'!$B$6:$D$17,3,FALSE)-C267)*(13-'Zestawienie stanowisk'!$H$1)),\"-\")","v":"-"}]
[1,"Monter",2800,"Pracownik 264",{"$f":"IFERROR((VLOOKUP(B268,'Zestawienie stanowisk'!$B$5:$E$65,4,FALSE)),\"-\")","v":1},{"$f":"IFERROR(((C268-(VLOOKUP(E268,'Siatka płac'!$B$6:$E$17,3,FALSE)))/(VLOOKUP(E268,'Siatka płac'!$B$6:$E$17,4,FALSE)-VLOOKUP(E268,'Siatka płac'!$B$6:$E$17,3,FALSE))),\"-\")","v":0.4},"II",{"$f":"IF(G268=\"poniżej min.\",((VLOOKUP(E268,'Siatka płac'!$B$6:$D$17,3,FALSE)-C268)*(13-'Zestawienie stanowisk'!$H$1)),\"-\")","v":"-"}]
[1,"Monter",2800,"Pracownik 265",{"$f":"IFERROR((VLOOKUP(B269,'Zestawienie stanowisk'!$B$5:$E$65,4,FALSE)),\"-\")","v":1},{"$f":"IFERROR(((C269-(VLOOKUP(E269,'Siatka płac'!$B$6:$E$17,3,FALSE)))/(VLOOKUP(E269,'Siatka płac'!$B$6:$E$17,4,FALSE)-VLOOKUP(E269,'Siatka płac'!$B$6:$E$17,3,FALSE))),\"-\")","v":0.4},"II",{"$f":"IF(G269=\"poniżej min.\",((VLOOKUP(E269,'Siatka płac'!$B$6:$D$17,3,FALSE)-C269)*(13-'Zestawienie stanowisk'!$H$1)),\"-\")","v":"-"}]
[1,"Monter",2800,"Pracownik 266",{"$f":"IFERROR((VLOOKUP(B270,'Zestawienie stanowisk'!$B$5:$E$65,4,FALSE)),\"-\")","v":1},{"$f":"IFERROR(((C270-(VLOOKUP(E270,'Siatka płac'!$B$6:$E$17,3,FALSE)))/(VLOOKUP(E270,'Siatka płac'!$B$6:$E$17,4,FALSE)-VLOOKUP(E270,'Siatka płac'!$B$6:$E$17,3,FALSE))),\"-\")","v":0.4},"II",{"$f":"IF(G270=\"poniżej min.\",((VLOOKUP(E270,'Siatka płac'!$B$6:$D$17,3,FALSE)-C270)*(13-'Zestawienie stanowisk'!$H$1)),\"-\")","v":"-"}]
[1,"Monter",2800,"Pracownik 267",{"$f":"IFERROR((VLOOKUP(B271,'Zestawienie stanowisk'!$B$5:$E$65,4,FALSE)),\"-\")","v":1},{"$f":"IFERROR(((C271-(VLOOKUP(E271,'Siatka płac'!$B$6:$E$17,3,FALSE)))/(VLOOKUP(E271,'Siatka płac'!$B$6:$E$17,4,FALSE)-VLOOKUP(E271,'Siatka płac'!$B$6:$E$17,3,FALSE))),\"-\")","v":0.4},"II",{"$f":"IF(G271=\"poniżej min.\",((VLOOKUP(E271,'Siatka płac'!$B$6:$D$17,3,FALSE)-C271)*(13-'Zestawienie stanowisk'!$H$1)),\"-\")","v":"-"}]
[1,"Monter",2800,"Pracownik 268",{"$f":"IFERROR((VLOOKUP(B272,'Zestawienie stanowisk'!$B$5:$E$65,4,FALSE)),\"-\")","v":1},{"$f":"IFERROR(((C272-(VLOOKUP(E272,'Siatka płac'!$B$6:$E$17,3,FALSE)))/(VLOOKUP(E272,'Siatka płac'!$B$6:$E$17,4,FALSE)-VLOOKUP(E272,'Siatka płac'!$B$6:$E$17,3,FALSE))),\"-\")","v":0.4},"II",{"$f":"IF(G272=\"poniżej min.\",((VLOOKUP(E272,'Siatka płac'!$B$6:$D$17,3,FALSE)-C272)*(13-'Zestawienie stanowisk'!$H$1)),\"-\")","v":"-"}]
[1,"Monter",2800,"Pracownik 269",{"$f":"IFERROR((VLOOKUP(B273,'Zestawienie stanowisk'!$B$5:$E$65,4,FALSE)),\"-\")","v":1},{"$f":"IFERROR(((C273-(VLOOKUP(E273,'Siatka płac'!$B$6:$E$17,3,FALSE)))/(VLOOKUP(E273,'Siatka płac'!$B$6:$E$17,4,FALSE)-VLOOKUP(E273,'Siatka płac'!$B$6:$E$17,3,FALSE))),\"-\")","v":0.4},"II",{"$f":"IF(G273=\"poniżej min.\",((VLOOKUP(E273,'Siatka płac'!$B$6:$D$17,3,FALSE)-C273)*(13-'Zestawienie stanowisk'!$H$1)),\"-\")","v":"-"}]
[1,"Monter",2800,"Pracownik 270",{"$f":"IFERROR((VLOOKUP(B274,'Zestawienie stanowisk'!$B$5:$E$65,4,FALSE)),\"-\")","v":1},{"$f":"IFERROR(((C274-(VLOOKUP(E274,'Siatka płac'!$B$6:$E$17,3,FALSE)))/(VLOOKUP(E274,'Siatka płac'!$B$6:$E$17,4,FALSE)-VLOOKUP(E274,'Siatka płac'!$B$6:$E$17,3,FALSE))),\"-\")","v":0.4},"II",{"$f":"IF(G274=\"poniżej min.\",((VLOOKUP(E274,'Siatka płac'!$B$6:$D$17,3,FALSE)-C274)*(13-'Zestawienie stanowisk'!$H$1)),\"-\")","v":"-"}]
[1,"Monter",2800,"Pracownik 271",{"$f":"IFERROR((VLOOKUP(B275,'Zestawienie stanowisk'!$B$5:$E$65,4,FALSE)),\"-\")","v":1},{"$f":"IFERROR(((C275-(VLOOKUP(E275,'Siatka płac'!$B$6:$E$17,3,FALSE)))/(VLOOKUP(E275,'Siatka płac'!$B$6:$E$17,4,FALSE)-VLOOKUP(E275,'Siatka płac'!$B$6:$E$17,3,FALSE))),\"-\")","v":0.4},"II",{"$f":"IF(G275=\"poniżej min.\",((VLOOKUP(E275,'Siatka płac'!$B$6:$D$17,3,FALSE)-C275)*(13-'Zestawienie stanowisk'!$H$1)),\"-\")","v":"-"}]
[1,"Monter",2800,"Pracownik 272",{"$f":"IFERROR((VLOOKUP(B276,'Zestawienie stanowisk'!$B$5:$E$65,4,FALSE)),\"-\")","v":1},{"$f":"IFERROR(((C276-(VLOOKUP(E276,'Siatka płac'!$B$6:$E$17,3,FALSE)))/(VLOOKUP(E276,'Siatka płac'!$B$6:$E$17,4,FALSE)-VLOOKUP(E276,'Siatka płac'!$B$6:$E$17,3,FALSE))),\"-\")","v":0.4},"II",{"$f":"IF(G276=\"poniżej min.\",((VLOOKUP(E276,'Siatka płac'!$B$6:$D$17,3,FALSE)-C276)*(13-'Zestawienie stanowisk'!$H$1)),\"-\")","v":"-"}]
[1,"Monter",2800,"Pracownik 273",{"$f":"IFERROR((VLOOKUP(B277,'Zestawienie stanowisk'!$B$5:$E$65,4,FALSE)),\"-\")","v":1},{"$f":"IFERROR(((C277-(VLOOKUP(E277,'Siatka płac'!$B$6:$E$17,3,FALSE)))/(VLOOKUP(E277,'Siatka płac'!$B$6:$E$17,4,FALSE)-VLOOKUP(E277,'Siatka płac'!$B$6:$E$17,3,FALSE))),\"-\")","v":0.4},"II",{"$f":"IF(G277=\"poniżej min.\",((VLOOKUP(E277,'Siatka płac'!$B$6:$D$17,3,FALSE)-C277)*(13-'Zestawienie stanowisk'!$H$1)),\"-\")","v":"-"}]
[1,"Monter",2800,"Pracownik 274",{"$f":"IFERROR((VLOOKUP(B278,'Zestawienie stanowisk'!$B$5:$E$65,4,FALSE)),\"-\")","v":1},{"$f":"IFERROR(((C278-(VLOOKUP(E278,'Siatka płac'!$B$6:$E$17,3,FALSE)))/(VLOOKUP(E278,'Siatka płac'!$B$6:$E$17,4,FALSE)-VLOOKUP(E278,'Siatka płac'!$B$6:$E$17,3,FALSE))),\"-\")","v":0.4},"II",{"$f":"IF(G278=\"poniżej min.\",((VLOOKUP(E278,'Siatka płac'!$B$6:$D$17,3,FALSE)-C278)*(13-'Zestawienie stanowisk'!$H$1)),\"-\")","v":"-"}]
[1,"Monter",2800,"Pracownik 275",{"$f":"IFERROR((VLOOKUP(B279,'Zestawienie stanowisk'!$B$5:$E$65,4,FALSE)),\"-\")","v":1},{"$f":"IFERROR(((C279-(VLOOKUP(E279,'Siatka płac'!$B$6:$E$17,3,FALSE)))/(VLOOKUP(E279,'Siatka płac'!$B$6:$E$17,4,FALSE)-VLOOKUP(E279,'Siatka płac'!$B$6:$E$17,3,FALSE))),\"-\")","v":0.4},"II",{"$f":"IF(G279=\"poniżej min.\",((VLOOKUP(E279,'Siatka płac'!$B$6:$D$17,3,FALSE)-C279)*(13-'Zestawienie stanowisk'!$H$1)),\"-\")","v":"-"}]
[1,"Monter",2800,"Pracownik 276",{"$f":"IFERROR((VLOOKUP(B280,'Zestawienie stanowisk'!$B$5:$E$65,4,FALSE)),\"-\")","v":1},{"$f":"IFERROR(((C280-(VLOOKUP(E280,'Siatka płac'!$B$6:$E$17,3,FALSE)))/(VLOOKUP(E280,'Siatka płac'!$B$6:$E$17,4,FALSE)-VLOOKUP(E280,'Siatka płac'!$B$6:$E$17,3,FALSE))),\"-\")","v":0.4},"II",{"$f":"IF(G280=\"poniżej min.\",((VLOOKUP(E280,'Siatka płac'!$B$6:$D$17,3,FALSE)-C280)*(13-'Zestawienie stanowisk'!$H$1)),\"-\")","v":"-"}]
[1,"Monter",2800,"Pracownik 277",{"$f":"IFERROR((VLOOKUP(B281,'Zestawienie stanowisk'!$B$5:$E$65,4,FALSE)),\"-\")","v":1},{"$f":"IFERROR(((C281-(VLOOKUP(E281,'Siatka płac'!$B$6:$E$17,3,FALSE)))/(VLOOKUP(E281,'Siatka płac'!$B$6:$E$17,4,FALSE)-VLOOKUP(E281,'Siatka płac'!$B$6:$E$17,3,FALSE))),\"-\")","v":0.4},"II",{"$f":"IF(G281=\"poniżej min.\",((VLOOKUP(E281,'Siatka płac'!$B$6:$D$17,3,FALSE)-C281)*(13-'Zestawienie stanowisk'!$H$1)),\"-\")","v":"-"}]
[1,"Monter",2800,"Pracownik 278",{"$f":"IFERROR((VLOOKUP(B282,'Zestawienie stanowisk'!$B$5:$E$65,4,FALSE)),\"-\")","v":1},{"$f":"IFERROR(((C282-(VLOOKUP(E282,'Siatka płac'!$B$6:$E$17,3,FALSE)))/(VLOOKUP(E282,'Siatka płac'!$B$6:$E$17,4,FALSE)-VLOOKUP(E282,'Siatka płac'!$B$6:$E$17,3,FALSE))),\"-\")","v":0.4},"II",{"$f":"IF(G282=\"poniżej min.\",((VLOOKUP(E282,'Siatka płac'!$B$6:$D$17,3,FALSE)-C282)*(13-'Zestawienie stanowisk'!$H$1)),\"-\")","v":"-"}]
[1,"Monter",2800,"Pracownik 279",{"$f":"IFERROR((VLOOKUP(B283,'Zestawienie stanowisk'!$B$5:$E$65,4,FALSE)),\"-\")","v":1},{"$f":"IFERROR(((C283-(VLOOKUP(E283,'Siatka płac'!$B$6:$E$17,3,FALSE)))/(VLOOKUP(E283,'Siatka płac'!$B$6:$E$17,4,FALSE)-VLOOKUP(E283,'Siatka płac'!$B$6:$E$17,3,FALSE))),\"-\")","v":0.4},"II",{"$f":"IF(G283=\"poniżej min.\",((VLOOKUP(E283,'Siatka płac'!$B$6:$D$17,3,FALSE)-C283)*(13-'Zestawienie stanowisk'!$H$1)),\"-\")","v":"-"}]
[1,"Monter",2800,"Pracownik 280",{"$f":"IFERROR((VLOOKUP(B284,'Zestawienie stanowisk'!$B$5:$E$65,4,FALSE)),\"-\")","v":1},{"$f":"IFERROR(((C284-(VLOOKUP(E284,'Siatka płac'!$B$6:$E$17,3,FALSE)))/(VLOOKUP(E284,'Siatka płac'!$B$6:$E$17,4,FALSE)-VLOOKUP(E284,'Siatka płac'!$B$6:$E$17,3,FALSE))),\"-\")","v":0.4},"II",{"$f":"IF(G284=\"poniżej min.\",((VLOOKUP(E284,'Siatka płac'!$B$6:$D$17,3,FALSE)-C284)*(13-'Zestawienie stanowisk'!$H$1)),\"-\")","v":"-"}]
[1,"Monter",2800,"Pracownik 281",{"$f":"IFERROR((VLOOKUP(B285,'Zestawienie stanowisk'!$B$5:$E$65,4,FALSE)),\"-\")","v":1},{"$f":"IFERROR(((C285-(VLOOKUP(E285,'Siatka płac'!$B$6:$E$17,3,FALSE)))/(VLOOKUP(E285,'Siatka płac'!$B$6:$E$17,4,FALSE)-VLOOKUP(E285,'Siatka płac'!$B$6:$E$17,3,FALSE))),\"-\")","v":0.4},"II",{"$f":"IF(G285=\"poniżej min.\",((VLOOKUP(E285,'Siatka płac'!$B$6:$D$17,3,FALSE)-C285)*(13-'Zestawienie stanowisk'!$H$1)),\"-\")","v":"-"}]
[1,"Monter",2800,"Pracownik 282",{"$f":"IFERROR((VLOOKUP(B286,'Zestawienie stanowisk'!$B$5:$E$65,4,FALSE)),\"-\")","v":1},{"$f":"IFERROR(((C286-(VLOOKUP(E286,'Siatka płac'!$B$6:$E$17,3,FALSE)))/(VLOOKUP(E286,'Siatka płac'!$B$6:$E$17,4,FALSE)-VLOOKUP(E286,'Siatka płac'!$B$6:$E$17,3,FALSE))),\"-\")","v":0.4},"II",{"$f":"IF(G286=\"poniżej min.\",((VLOOKUP(E286,'Siatka płac'!$B$6:$D$17,3,FALSE)-C286)*(13-'Zestawienie stanowisk'!$H$1)),\"-\")","v":"-"}]
[1,"Monter",2800,"Pracownik 283",{"$f":"IFERROR((VLOOKUP(B287,'Zestawienie stanowisk'!$B$5:$E$65,4,FALSE)),\"-\")","v":1},{"$f":"IFERROR(((C287-(VLOOKUP(E287,'Siatka płac'!$B$6:$E$17,3,FALSE)))/(VLOOKUP(E287,'Siatka płac'!$B$6:$E$17,4,FALSE)-VLOOKUP(E287,'Siatka płac'!$B$6:$E$17,3,FALSE))),\"-\")","v":0.4},"II",{"$f":"IF(G287=\"poniżej min.\",((VLOOKUP(E287,'Siatka płac'!$B$6:$D$17,3,FALSE)-C287)*(13-'Zestawienie stanowisk'!$H$1)),\"-\")","v":"-"}]
[1,"Monter",2800,"Pracownik 284",{"$f":"IFERROR((VLOOKUP(B288,'Zestawienie stanowisk'!$B$5:$E$65,4,FALSE)),\"-\")","v":1},{"$f":"IFERROR(((C288-(VLOOKUP(E288,'Siatka płac'!$B$6:$E$17,3,FALSE)))/(VLOOKUP(E288,'Siatka płac'!$B$6:$E$17,4,FALSE)-VLOOKUP(E288,'Siatka płac'!$B$6:$E$17,3,FALSE))),\"-\")","v":0.4},"II",{"$f":"IF(G288=\"poniżej min.\",((VLOOKUP(E288,'Siatka płac'!$B$6:$D$17,3,FALSE)-C288)*(13-'Zestawienie stanowisk'!$H$1)),\"-\")","v":"-"}]
[1,"Monter",2800,"Pracownik 285",{"$f":"IFERROR((VLOOKUP(B289,'Zestawienie stanowisk'!$B$5:$E$65,4,FALSE)),\"-\")","v":1},{"$f":"IFERROR(((C289-(VLOOKUP(E289,'Siatka płac'!$B$6:$E$17,3,FALSE)))/(VLOOKUP(E289,'Siatka płac'!$B$6:$E$17,4,FALSE)-VLOOKUP(E289,'Siatka płac'!$B$6:$E$17,3,FALSE))),\"-\")","v":0.4},"II",{"$f":"IF(G289=\"poniżej min.\",((VLOOKUP(E289,'Siatka płac'!$B$6:$D$17,3,FALSE)-C289)*(13-'Zestawienie stanowisk'!$H$1)),\"-\")","v":"-"}]
[1,"Monter",2800,"Pracownik 286",{"$f":"IFERROR((VLOOKUP(B290,'Zestawienie stanowisk'!$B$5:$E$65,4,FALSE)),\"-\")","v":1},{"$f":"IFERROR(((C290-(VLOOKUP(E290,'Siatka płac'!$B$6:$E$17,3,FALSE)))/(VLOOKUP(E290,'Siatka płac'!$B$6:$E$17,4,FALSE)-VLOOKUP(E290,'Siatka płac'!$B$6:$E$17,3,FALSE))),\"-\")","v":0.4},"II",{"$f":"IF(G290=\"poniżej min.\",((VLOOKUP(E290,'Siatka płac'!$B$6:$D$17,3,FALSE)-C290)*(13-'Zestawienie stanowisk'!$H$1)),\"-\")","v":"-"}]
[1,"Monter",3200,"Pracownik 287",{"$f":"IFERROR((VLOOKUP(B291,'Zestawienie stanowisk'!$B$5:$E$65,4,FALSE)),\"-\")","v":1},{"$f":"IFERROR(((C291-(VLOOKUP(E291,'Siatka płac'!$B$6:$E$17,3,FALSE)))/(VLOOKUP(E291,'Siatka płac'!$B$6:$E$17,4,FALSE)-VLOOKUP(E291,'Siatka płac'!$B$6:$E$17,3,FALSE))),\"-\")","v":0.6},"III",{"$f":"IF(G291=\"poniżej min.\",((VLOOKUP(E291,'Siatka płac'!$B$6:$D$17,3,FALSE)-C291)*(13-'Zestawienie stanowisk'!$H$1)),\"-\")","v":"-"}]
[1,"Monter",3200,"Pracownik 288",{"$f":"IFERROR((VLOOKUP(B292,'Zestawienie stanowisk'!$B$5:$E$65,4,FALSE)),\"-\")","v":1},{"$f":"IFERROR(((C292-(VLOOKUP(E292,'Siatka płac'!$B$6:$E$17,3,FALSE)))/(VLOOKUP(E292,'Siatka płac'!$B$6:$E$17,4,FALSE)-VLOOKUP(E292,'Siatka płac'!$B$6:$E$17,3,FALSE))),\"-\")","v":0.6},"III",{"$f":"IF(G292=\"poniżej min.\",((VLOOKUP(E292,'Siatka płac'!$B$6:$D$17,3,FALSE)-C292)*(13-'Zestawienie stanowisk'!$H$1)),\"-\")","v":"-"}]
[1,"Monter",3200,"Pracownik 289",{"$f":"IFERROR((VLOOKUP(B293,'Zestawienie stanowisk'!$B$5:$E$65,4,FALSE)),\"-\")","v":1},{"$f":"IFERROR(((C293-(VLOOKUP(E293,'Siatka płac'!$B$6:$E$17,3,FALSE)))/(VLOOKUP(E293,'Siatka płac'!$B$6:$E$17,4,FALSE)-VLOOKUP(E293,'Siatka płac'!$B$6:$E$17,3,FALSE))),\"-\")","v":0.6},"III",{"$f":"IF(G293=\"poniżej min.\",((VLOOKUP(E293,'Siatka płac'!$B$6:$D$17,3,FALSE)-C293)*(13-'Zestawienie stanowisk'!$H$1)),\"-\")","v":"-"}]
[1,"Monter",3200,"Pracownik 290",{"$f":"IFERROR((VLOOKUP(B294,'Zestawienie stanowisk'!$B$5:$E$65,4,FALSE)),\"-\")","v":1},{"$f":"IFERROR(((C294-(VLOOKUP(E294,'Siatka płac'!$B$6:$E$17,3,FALSE)))/(VLOOKUP(E294,'Siatka płac'!$B$6:$E$17,4,FALSE)-VLOOKUP(E294,'Siatka płac'!$B$6:$E$17,3,FALSE))),\"-\")","v":0.6},"III",{"$f":"IF(G294=\"poniżej min.\",((VLOOKUP(E294,'Siatka płac'!$B$6:$D$17,3,FALSE)-C294)*(13-'Zestawienie stanowisk'!$H$1)),\"-\")","v":"-"}]
[1,"Monter",3200,"Pracownik 291",{"$f":"IFERROR((VLOOKUP(B295,'Zestawienie stanowisk'!$B$5:$E$65,4,FALSE)),\"-\")","v":1},{"$f":"IFERROR(((C295-(VLOOKUP(E295,'Siatka płac'!$B$6:$E$17,3,FALSE)))/(VLOOKUP(E295,'Siatka płac'!$B$6:$E$17,4,FALSE)-VLOOKUP(E295,'Siatka płac'!$B$6:$E$17,3,FALSE))),\"-\")","v":0.6},"III",{"$f":"IF(G295=\"poniżej min.\",((VLOOKUP(E295,'Siatka płac'!$B$6:$D$17,3,FALSE)-C295)*(13-'Zestawienie stanowisk'!$H$1)),\"-\")","v":"-"}]
[1,"Monter",3200,"Pracownik 292",{"$f":"IFERROR((VLOOKUP(B296,'Zestawienie stanowisk'!$B$5:$E$65,4,FALSE)),\"-\")","v":1},{"$f":"IFERROR(((C296-(VLOOKUP(E296,'Siatka płac'!$B$6:$E$17,3,FALSE)))/(VLOOKUP(E296,'Siatka płac'!$B$6:$E$17,4,FALSE)-VLOOKUP(E296,'Siatka płac'!$B$6:$E$17,3,FALSE))),\"-\")","v":0.6},"III",{"$f":"IF(G296=\"poniżej min.\",((VLOOKUP(E296,'Siatka płac'!$B$6:$D$17,3,FALSE)-C296)*(13-'Zestawienie stanowisk'!$H$1)),\"-\")","v":"-"}]
[1,"Monter",3200,"Pracownik 293",{"$f":"IFERROR((VLOOKUP(B297,'Zestawienie stanowisk'!$B$5:$E$65,4,FALSE)),\"-\")","v":1},{"$f":"IFERROR(((C297-(VLOOKUP(E297,'Siatka płac'!$B$6:$E$17,3,FALSE)))/(VLOOKUP(E297,'Siatka płac'!$B$6:$E$17,4,FALSE)-VLOOKUP(E297,'Siatka płac'!$B$6:$E$17,3,FALSE))),\"-\")","v":0.6},"III",{"$f":"IF(G297=\"poniżej min.\",((VLOOKUP(E297,'Siatka płac'!$B$6:$D$17,3,FALSE)-C297)*(13-'Zestawienie stanowisk'!$H$1)),\"-\")","v":"-"}]
[1,"Monter",3200,"Pracownik 294",{"$f":"IFERROR((VLOOKUP(B298,'Zestawienie stanowisk'!$B$5:$E$65,4,FALSE)),\"-\")","v":1},{"$f":"IFERROR(((C298-(VLOOKUP(E298,'Siatka płac'!$B$6:$E$17,3,FALSE)))/(VLOOKUP(E298,'Siatka płac'!$B$6:$E$17,4,FALSE)-VLOOKUP(E298,'Siatka płac'!$B$6:$E$17,3,FALSE))),\"-\")","v":0.6},"III",{"$f":"IF(G298=\"poniżej min.\",((VLOOKUP(E298,'Siatka płac'!$B$6:$D$17,3,FALSE)-C298)*(13-'Zestawienie stanowisk'!$H$1)),\"-\")","v":"-"}]
[1,"Monter",3200,"Pracownik 295",{"$f":"IFERROR((VLOOKUP(B299,'Zestawienie stanowisk'!$B$5:$E$65,4,FALSE)),\"-\")","v":1},{"$f":"IFERROR(((C299-(VLOOKUP(E299,'Siatka płac'!$B$6:$E$17,3,FALSE)))/(VLOOKUP(E299,'Siatka płac'!$B$6:$E$17,4,FALSE)-VLOOKUP(E299,'Siatka płac'!$B$6:$E$17,3,FALSE))),\"-\")","v":0.6},"III",{"$f":"IF(G299=\"poniżej min.\",((VLOOKUP(E299,'Siatka płac'!$B$6:$D$17,3,FALSE)-C299)*(13-'Zestawienie stanowisk'!$H$1)),\"-\")","v":"-"}]
[1,"Monter",3200,"Pracownik 296",{"$f":"IFERROR((VLOOKUP(B300,'Zestawienie stanowisk'!$B$5:$E$65,4,FALSE)),\"-\")","v":1},{"$f":"IFERROR(((C300-(VLOOKUP(E300,'Siatka płac'!$B$6:$E$17,3,FALSE)))/(VLOOKUP(E300,'Siatka płac'!$B$6:$E$17,4,FALSE)-VLOOKUP(E300,'Siatka płac'!$B$6:$E$17,3,FALSE))),\"-\")","v":0.6},"III",{"$f":"IF(G300=\"poniżej min.\",((VLOOKUP(E300,'Siatka płac'!$B$6:$D$17,3,FALSE)-C300)*(13-'Zestawienie stanowisk'!$H$1)),\"-\")","v":"-"}]
[1,"Monter",3200,"Pracownik 297",{"$f":"IFERROR((VLOOKUP(B301,'Zestawienie stanowisk'!$B$5:$E$65,4,FALSE)),\"-\")","v":1},{"$f":"IFERROR(((C301-(VLOOKUP(E301,'Siatka płac'!$B$6:$E$17,3,FALSE)))/(VLOOKUP(E301,'Siatka płac'!$B$6:$E$17,4,FALSE)-VLOOKUP(E301,'Siatka płac'!$B$6:$E$17,3,FALSE))),\"-\")","v":0.6},"III",{"$f":"IF(G301=\"poniżej min.\",((VLOOKUP(E301,'Siatka płac'!$B$6:$D$17,3,FALSE)-C301)*(13-'Zestawienie stanowisk'!$H$1)),\"-\")","v":"-"}]
[1,"Monter",3200,"Pracownik 298",{"$f":"IFERROR((VLOOKUP(B302,'Zestawienie stanowisk'!$B$5:$E$65,4,FALSE)),\"-\")","v":1},{"$f":"IFERROR(((C302-(VLOOKUP(E302,'Siatka płac'!$B$6:$E$17,3,FALSE)))/(VLOOKUP(E302,'Siatka płac'!$B$6:$E$17,4,FALSE)-VLOOKUP(E302,'Siatka płac'!$B$6:$E$17,3,FALSE))),\"-\")","v":0.6},"III",{"$f":"IF(G302=\"poniżej min.\",((VLOOKUP(E302,'Siatka płac'!$B$6:$D$17,3,FALSE)-C302)*(13-'Zestawienie stanowisk'!$H$1)),\"-\")","v":"-"}]
[1,"Monter",3200,"Pracownik 299",{"$f":"IFERROR((VLOOKUP(B303,'Zestawienie stanowisk'!$B$5:$E$65,4,FALSE)),\"-\")","v":1},{"$f":"IFERROR(((C303-(VLOOKUP(E303,'Siatka płac'!$B$6:$E$17,3,FALSE)))/(VLOOKUP(E303,'Siatka płac'!$B$6:$E$17,4,FALSE)-VLOOKUP(E303,'Siatka płac'!$B$6:$E$17,3,FALSE))),\"-\")","v":0.6},"III",{"$f":"IF(G303=\"poniżej min.\",((VLOOKUP(E303,'Siatka płac'!$B$6:$D$17,3,FALSE)-C303)*(13-'Zestawienie stanowisk'!$H$1)),\"-\")","v":"-"}]
[1,"Monter",3200,"Pracownik 300",{"$f":"IFERROR((VLOOKUP(B304,'Zestawienie stanowisk'!$B$5:$E$65,4,FALSE)),\"-\")","v":1},{"$f":"IFERROR(((C304-(VLOOKUP(E304,'Siatka płac'!$B$6:$E$17,3,FALSE)))/(VLOOKUP(E304,'Siatka płac'!$B$6:$E$17,4,FALSE)-VLOOKUP(E304,'Siatka płac'!$B$6:$E$17,3,FALSE))),\"-\")","v":0.6},"III",{"$f":"IF(G304=\"poniżej min.\",((VLOOKUP(E304,'Siatka płac'!$B$6:$D$17,3,FALSE)-C304)*(13-'Zestawienie stanowisk'!$H$1)),\"-\")","v":"-"}]
[1,"Monter",3200,"Pracownik 301",{"$f":"IFERROR((VLOOKUP(B305,'Zestawienie stanowisk'!$B$5:$E$65,4,FALSE)),\"-\")","v":1},{"$f":"IFERROR(((C305-(VLOOKUP(E305,'Siatka płac'!$B$6:$E$17,3,FALSE)))/(VLOOKUP(E305,'Siatka płac'!$B$6:$E$17,4,FALSE)-VLOOKUP(E305,'Siatka płac'!$B$6:$E$17,3,FALSE))),\"-\")","v":0.6},"III",{"$f":"IF(G305=\"poniżej min.\",((VLOOKUP(E305,'Siatka płac'!$B$6:$D$17,3,FALSE)-C305)*(13-'Zestawienie stanowisk'!$H$1)),\"-\")","v":"-"}]
[1,"Monter",3200,"Pracownik 302",{"$f":"IFERROR((VLOOKUP(B306,'Zestawienie stanowisk'!$B$5:$E$65,4,FALSE)),\"-\")","v":1},{"$f":"IFERROR(((C306-(VLOOKUP(E306,'Siatka płac'!$B$6:$E$17,3,FALSE)))/(VLOOKUP(E306,'Siatka płac'!$B$6:$E$17,4,FALSE)-VLOOKUP(E306,'Siatka płac'!$B$6:$E$17,3,FALSE))),\"-\")","v":0.6},"III",{"$f":"IF(G306=\"poniżej min.\",((VLOOKUP(E306,'Siatka płac'!$B$6:$D$17,3,FALSE)-C306)*(13-'Zestawienie stanowisk'!$H$1)),\"-\")","v":"-"}]
[1,"Monter",3200,"Pracownik 303",{"$f":"IFERROR((VLOOKUP(B307,'Zestawienie stanowisk'!$B$5:$E$65,4,FALSE)),\"-\")","v":1},{"$f":"IFERROR(((C307-(VLOOKUP(E307,'Siatka płac'!$B$6:$E$17,3,FALSE)))/(VLOOKUP(E307,'Siatka płac'!$B$6:$E$17,4,FALSE)-VLOOKUP(E307,'Siatka płac'!$B$6:$E$17,3,FALSE))),\"-\")","v":0.6},"III",{"$f":"IF(G307=\"poniżej min.\",((VLOOKUP(E307,'Siatka płac'!$B$6:$D$17,3,FALSE)-C307)*(13-'Zestawienie stanowisk'!$H$1)),\"-\")","v":"-"}]
[1,"Monter",3200,"Pracownik 304",{"$f":"IFERROR((VLOOKUP(B308,'Zestawienie stanowisk'!$B$5:$E$65,4,FALSE)),\"-\")","v":1},{"$f":"IFERROR(((C308-(VLOOKUP(E308,'Siatka płac'!$B$6:$E$17,3,FALSE)))/(VLOOKUP(E308,'Siatka płac'!$B$6:$E$17,4,FALSE)-VLOOKUP(E308,'Siatka płac'!$B$6:$E$17,3,FALSE))),\"-\")","v":0.6},"III",{"$f":"IF(G308=\"poniżej min.\",((VLOOKUP(E308,'Siatka płac'!$B$6:$D$17,3,FALSE)-C308)*(13-'Zestawienie stanowisk'!$H$1)),\"-\")","v":"-"}]
[1,"Monter",3200,"Pracownik 305",{"$f":"IFERROR((VLOOKUP(B309,'Zestawienie stanowisk'!$B$5:$E$65,4,FALSE)),\"-\")","v":1},{"$f":"IFERROR(((C309-(VLOOKUP(E309,'Siatka płac'!$B$6:$E$17,3,FALSE)))/(VLOOKUP(E309,'Siatka płac'!$B$6:$E$17,4,FALSE)-VLOOKUP(E309,'Siatka płac'!$B$6:$E$17,3,FALSE))),\"-\")","v":0.6},"III",{"$f":"IF(G309=\"poniżej min.\",((VLOOKUP(E309,'Siatka płac'!$B$6:$D$17,3,FALSE)-C309)*(13-'Zestawienie stanowisk'!$H$1)),\"-\")","v":"-"}]
[1,"Monter",3200,"Pracownik 306",{"$f":"IFERROR((VLOOKUP(B310,'Zestawienie stanowisk'!$B$5:$E$65,4,FALSE)),\"-\")","v":1},{"$f":"IFERROR(((C310-(VLOOKUP(E310,'Siatka płac'!$B$6:$E$17,3,FALSE)))/(VLOOKUP(E310,'Siatka płac'!$B$6:$E$17,4,FALSE)-VLOOKUP(E310,'Siatka płac'!$B$6:$E$17,3,FALSE))),\"-\")","v":0.6},"III",{"$f":"IF(G310=\"poniżej min.\",((VLOOKUP(E310,'Siatka płac'!$B$6:$D$17,3,FALSE)-C310)*(13-'Zestawienie stanowisk'!$H$1)),\"-\")","v":"-"}]
[1,"Monter",3200,"Pracownik 307",{"$f":"IFERROR((VLOOKUP(B311,'Zestawienie stanowisk'!$B$5:$E$65,4,FALSE)),\"-\")","v":1},{"$f":"IFERROR(((C311-(VLOOKUP(E311,'Siatka płac'!$B$6:$E$17,3,FALSE)))/(VLOOKUP(E311,'Siatka płac'!$B$6:$E$17,4,FALSE)-VLOOKUP(E311,'Siatka płac'!$B$6:$E$17,3,FALSE))),\"-\")","v":0.6},"III",{"$f":"IF(G311=\"poniżej min.\",((VLOOKUP(E311,'Siatka płac'!$B$6:$D$17,3,FALSE)-C311)*(13-'Zestawienie stanowisk'!$H$1)),\"-\")","v":"-"}]
[1,"Monter",3200,"Pracownik 308",{"$f":"IFERROR((VLOOKUP(B312,'Zestawienie stanowisk'!$B$5:$E$65,4,FALSE)),\"-\")","v":1},{"$f":"IFERROR(((C312-(VLOOKUP(E312,'Siatka płac'!$B$6:$E$17,3,FALSE)))/(VLOOKUP(E312,'Siatka płac'!$B$6:$E$17,4,FALSE)-VLOOKUP(E312,'Siatka płac'!$B$6:$E$17,3,FALSE))),\"-\")","v":0.6},"III",{"$f":"IF(G312=\"poniżej min.\",((VLOOKUP(E312,'Siatka płac'!$B$6:$D$17,3,FALSE)-C312)*(13-'Zestawienie stanowisk'!$H$1)),\"-\")","v":"-"}]
[1,"Monter",3200,"Pracownik 309",{"$f":"IFERROR((VLOOKUP(B313,'Zestawienie stanowisk'!$B$5:$E$65,4,FALSE)),\"-\")","v":1},{"$f":"IFERROR(((C313-(VLOOKUP(E313,'Siatka płac'!$B$6:$E$17,3,FALSE)))/(VLOOKUP(E313,'Siatka płac'!$B$6:$E$17,4,FALSE)-VLOOKUP(E313,'Siatka płac'!$B$6:$E$17,3,FALSE))),\"-\")","v":0.6},"III",{"$f":"IF(G313=\"poniżej min.\",((VLOOKUP(E313,'Siatka płac'!$B$6:$D$17,3,FALSE)-C313)*(13-'Zestawienie stanowisk'!$H$1)),\"-\")","v":"-"}]
[1,"Monter",3200,"Pracownik 310",{"$f":"IFERROR((VLOOKUP(B314,'Zestawienie stanowisk'!$B$5:$E$65,4,FALSE)),\"-\")","v":1},{"$f":"IFERROR(((C314-(VLOOKUP(E314,'Siatka płac'!$B$6:$E$17,3,FALSE)))/(VLOOKUP(E314,'Siatka płac'!$B$6:$E$17,4,FALSE)-VLOOKUP(E314,'Siatka płac'!$B$6:$E$17,3,FALSE))),\"-\")","v":0.6},"III",{"$f":"IF(G314=\"poniżej min.\",((VLOOKUP(E314,'Siatka płac'!$B$6:$D$17,3,FALSE)-C314)*(13-'Zestawienie stanowisk'!$H$1)),\"-\")","v":"-"}]
[1,"Monter",3200,"Pracownik 311",{"$f":"IFERROR((VLOOKUP(B315,'Zestawienie stanowisk'!$B$5:$E$65,4,FALSE)),\"-\")","v":1},{"$f":"IFERROR(((C315-(VLOOKUP(E315,'Siatka płac'!$B$6:$E$17,3,FALSE)))/(VLOOKUP(E315,'Siatka płac'!$B$6:$E$17,4,FALSE)-VLOOKUP(E315,'Siatka płac'!$B$6:$E$17,3,FALSE))),\"-\")","v":0.6},"III",{"$f":"IF(G315=\"poniżej min.\",((VLOOKUP(E315,'Siatka płac'!$B$6:$D$17,3,FALSE)-C315)*(13-'Zestawienie stanowisk'!$H$1)),\"-\")","v":"-"}]
[1,"Monter",3200,"Pracownik 312",{"$f":"IFERROR((VLOOKUP(B316,'Zestawienie stanowisk'!$B$5:$E$65,4,FALSE)),\"-\")","v":1},{"$f":"IFERROR(((C316-(VLOOKUP(E316,'Siatka płac'!$B$6:$E$17,3,FALSE)))/(VLOOKUP(E316,'Siatka płac'!$B$6:$E$17,4,FALSE)-VLOOKUP(E316,'Siatka płac'!$B$6:$E$17,3,FALSE))),\"-\")","v":0.6},"III",{"$f":"IF(G316=\"poniżej min.\",((VLOOKUP(E316,'Siatka płac'!$B$6:$D$17,3,FALSE)-C316)*(13-'Zestawienie stanowisk'!$H$1)),\"-\")","v":"-"}]
[1,"Monter",3200,"Pracownik 313",{"$f":"IFERROR((VLOOKUP(B317,'Zestawienie stanowisk'!$B$5:$E$65,4,FALSE)),\"-\")","v":1},{"$f":"IFERROR(((C317-(VLOOKUP(E317,'Siatka płac'!$B$6:$E$17,3,FALSE)))/(VLOOKUP(E317,'Siatka płac'!$B$6:$E$17,4,FALSE)-VLOOKUP(E317,'Siatka płac'!$B$6:$E$17,3,FALSE))),\"-\")","v":0.6},"III",{"$f":"IF(G317=\"poniżej min.\",((VLOOKUP(E317,'Siatka płac'!$B$6:$D$17,3,FALSE)-C317)*(13-'Zestawienie stanowisk'!$H$1)),\"-\")","v":"-"}]
[1,"Monter",3200,"Pracownik 314",{"$f":"IFERROR((VLOOKUP(B318,'Zestawienie stanowisk'!$B$5:$E$65,4,FALSE)),\"-\")","v":1},{"$f":"IFERROR(((C318-(VLOOKUP(E318,'Siatka płac'!$B$6:$E$17,3,FALSE)))/(VLOOKUP(E318,'Siatka płac'!$B$6:$E$17,4,FALSE)-VLOOKUP(E318,'Siatka płac'!$B$6:$E$17,3,FALSE))),\"-\")","v":0.6},"III",{"$f":"IF(G318=\"poniżej min.\",((VLOOKUP(E318,'Siatka płac'!$B$6:$D$17,3,FALSE)-C318)*(13-'Zestawienie stanowisk'!$H$1)),\"-\")","v":"-"}]
[1,"Monter",3200,"Pracownik 315",{"$f":"IFERROR((VLOOKUP(B319,'Zestawienie stanowisk'!$B$5:$E$65,4,FALSE)),\"-\")","v":1},{"$f":"IFERROR(((C319-(VLOOKUP(E319,'Siatka płac'!$B$6:$E$17,3,FALSE)))/(VLOOKUP(E319,'Siatka płac'!$B$6:$E$17,4,FALSE)-VLOOKUP(E319,'Siatka płac'!$B$6:$E$17,3,FALSE))),\"-\")","v":0.6},"III",{"$f":"IF(G319=\"poniżej min.\",((VLOOKUP(E319,'Siatka płac'!$B$6:$D$17,3,FALSE)-C319)*(13-'Zestawienie stanowisk'!$H$1)),\"-\")","v":"-"}]
[1,"Monter",3200,"Pracownik 316",{"$f":"IFERROR((VLOOKUP(B320,'Zestawienie stanowisk'!$B$5:$E$65,4,FALSE)),\"-\")","v":1},{"$f":"IFERROR(((C320-(VLOOKUP(E320,'Siatka płac'!$B$6:$E$17,3,FALSE)))/(VLOOKUP(E320,'Siatka płac'!$B$6:$E$17,4,FALSE)-VLOOKUP(E320,'Siatka płac'!$B$6:$E$17,3,FALSE))),\"-\")","v":0.6},"III",{"$f":"IF(G320=\"poniżej min.\",((VLOOKUP(E320,'Siatka płac'!$B$6:$D$17,3,FALSE)-C320)*(13-'Zestawienie stanowisk'!$H$1)),\"-\")","v":"-"}]
[1,"Monter",3200,"Pracownik 317",{"$f":"IFERROR((VLOOKUP(B321,'Zestawienie stanowisk'!$B$5:$E$65,4,FALSE)),\"-\")","v":1},{"$f":"IFERROR(((C321-(VLOOKUP(E321,'Siatka płac'!$B$6:$E$17,3,FALSE)))/(VLOOKUP(E321,'Siatka płac'!$B$6:$E$17,4,FALSE)-VLOOKUP(E321,'Siatka płac'!$B$6:$E$17,3,FALSE))),\"-\")","v":0.6},"III",{"$f":"IF(G321=\"poniżej min.\",((VLOOKUP(E321,'Siatka płac'!$B$6:$D$17,3,FALSE)-C321)*(13-'Zestawienie stanowisk'!$H$1)),\"-\")","v":"-"}]
[1,"Monter",3200,"Pracownik 318",{"$f":"IFERROR((VLOOKUP(B322,'Zestawienie stanowisk'!$B$5:$E$65,4,FALSE)),\"-\")","v":1},{"$f":"IFERROR(((C322-(VLOOKUP(E322,'Siatka płac'!$B$6:$E$17,3,FALSE)))/(VLOOKUP(E322,'Siatka płac'!$B$6:$E$17,4,FALSE)-VLOOKUP(E322,'Siatka płac'!$B$6:$E$17,3,FALSE))),\"-\")","v":0.6},"III",{"$f":"IF(G322=\"poniżej min.\",((VLOOKUP(E322,'Siatka płac'!$B$6:$D$17,3,FALSE)-C322)*(13-'Zestawienie stanowisk'!$H$1)),\"-\")","v":"-"}]
[1,"Monter",3200,"Pracownik 319",{"$f":"IFERROR((VLOOKUP(B323,'Zestawienie stanowisk'!$B$5:$E$65,4,FALSE)),\"-\")","v":1},{"$f":"IFERROR(((C323-(VLOOKUP(E323,'Siatka płac'!$B$6:$E$17,3,FALSE)))/(VLOOKUP(E323,'Siatka płac'!$B$6:$E$17,4,FALSE)-VLOOKUP(E323,'Siatka płac'!$B$6:$E$17,3,FALSE))),\"-\")","v":0.6},"III",{"$f":"IF(G323=\"poniżej min.\",((VLOOKUP(E323,'Siatka płac'!$B$6:$D$17,3,FALSE)-C323)*(13-'Zestawienie stanowisk'!$H$1)),\"-\")","v":"-"}]
[1,"Monter",3200,"Pracownik 320",{"$f":"IFERROR((VLOOKUP(B324,'Zestawienie stanowisk'!$B$5:$E$65,4,FALSE)),\"-\")","v":1},{"$f":"IFERROR(((C324-(VLOOKUP(E324,'Siatka płac'!$B$6:$E$17,3,FALSE)))/(VLOOKUP(E324,'Siatka płac'!$B$6:$E$17,4,FALSE)-VLOOKUP(E324,'Siatka płac'!$B$6:$E$17,3,FALSE))),\"-\")","v":0.6},"III",{"$f":"IF(G324=\"poniżej min.\",((VLOOKUP(E324,'Siatka płac'!$B$6:$D$17,3,FALSE)-C324)*(13-'Zestawienie stanowisk'!$H$1)),\"-\")","v":"-"}]
[{"$f":"IF(ISBLANK(B325),0,1)","v":1},"Monter",3200,"Pracownik 321",{"$f":"IFERROR((VLOOKUP(B325,'Zestawienie stanowisk'!$B$5:$E$65,4,FALSE)),\"-\")","v":1},{"$f":"IFERROR(((C325-(VLOOKUP(E325,'Siatka płac'!$B$6:$E$17,3,FALSE)))/(VLOOKUP(E325,'Siatka płac'!$B$6:$E$17,4,FALSE)-VLOOKUP(E325,'Siatka płac'!$B$6:$E$17,3,FALSE))),\"-\")","v":0.6},{"$f":"IFERROR((INDEX($N$5:$N$10,MATCH(F325,$M$5:$M$10,-1))),\"-\")","v":"III"},{"$f":"IF(G325=\"poniżej min.\",((VLOOKUP(E325,'Siatka płac'!$B$6:$D$17,3,FALSE)-C325)*(13-'Zestawienie stanowisk'!$H$1)),\"-\")","v":"-"}]
[1,"Monter",3200,"Pracownik 322",{"$f":"IFERROR((VLOOKUP(B326,'Zestawienie stanowisk'!$B$5:$E$65,4,FALSE)),\"-\")","v":1},{"$f":"IFERROR(((C326-(VLOOKUP(E326,'Siatka płac'!$B$6:$E$17,3,FALSE)))/(VLOOKUP(E326,'Siatka płac'!$B$6:$E$17,4,FALSE)-VLOOKUP(E326,'Siatka płac'!$B$6:$E$17,3,FALSE))),\"-\")","v":0.6},"III",{"$f":"IF(G326=\"poniżej min.\",((VLOOKUP(E326,'Siatka płac'!$B$6:$D$17,3,FALSE)-C326)*(13-'Zestawienie stanowisk'!$H$1)),\"-\")","v":"-"}]
[1,"Monter",3200,"Pracownik 323",{"$f":"IFERROR((VLOOKUP(B327,'Zestawienie stanowisk'!$B$5:$E$65,4,FALSE)),\"-\")","v":1},{"$f":"IFERROR(((C327-(VLOOKUP(E327,'Siatka płac'!$B$6:$E$17,3,FALSE)))/(VLOOKUP(E327,'Siatka płac'!$B$6:$E$17,4,FALSE)-VLOOKUP(E327,'Siatka płac'!$B$6:$E$17,3,FALSE))),\"-\")","v":0.6},"III",{"$f":"IF(G327=\"poniżej min.\",((VLOOKUP(E327,'Siatka płac'!$B$6:$D$17,3,FALSE)-C327)*(13-'Zestawienie stanowisk'!$H$1)),\"-\")","v":"-"}]
[1,"Monter",3200,"Pracownik 324",{"$f":"IFERROR((VLOOKUP(B328,'Zestawienie stanowisk'!$B$5:$E$65,4,FALSE)),\"-\")","v":1},{"$f":"IFERROR(((C328-(VLOOKUP(E328,'Siatka płac'!$B$6:$E$17,3,FALSE)))/(VLOOKUP(E328,'Siatka płac'!$B$6:$E$17,4,FALSE)-VLOOKUP(E328,'Siatka płac'!$B$6:$E$17,3,FALSE))),\"-\")","v":0.6},"III",{"$f":"IF(G328=\"poniżej min.\",((VLOOKUP(E328,'Siatka płac'!$B$6:$D$17,3,FALSE)-C328)*(13-'Zestawienie stanowisk'!$H$1)),\"-\")","v":"-"}]
[1,"Monter",3500,"Pracownik 325",{"$f":"IFERROR((VLOOKUP(B329,'Zestawienie stanowisk'!$B$5:$E$65,4,FALSE)),\"-\")","v":1},{"$f":"IFERROR(((C329-(VLOOKUP(E329,'Siatka płac'!$B$6:$E$17,3,FALSE)))/(VLOOKUP(E329,'Siatka płac'!$B$6:$E$17,4,FALSE)-VLOOKUP(E329,'Siatka płac'!$B$6:$E$17,3,FALSE))),\"-\")","v":0.75},"III",{"$f":"IF(G329=\"poniżej min.\",((VLOOKUP(E329,'Siatka płac'!$B$6:$D$17,3,FALSE)-C329)*(13-'Zestawienie stanowisk'!$H$1)),\"-\")","v":"-"}]
[1,"Monter",3500,"Pracownik 326",{"$f":"IFERROR((VLOOKUP(B330,'Zestawienie stanowisk'!$B$5:$E$65,4,FALSE)),\"-\")","v":1},{"$f":"IFERROR(((C330-(VLOOKUP(E330,'Siatka płac'!$B$6:$E$17,3,FALSE)))/(VLOOKUP(E330,'Siatka płac'!$B$6:$E$17,4,FALSE)-VLOOKUP(E330,'Siatka płac'!$B$6:$E$17,3,FALSE))),\"-\")","v":0.75},"III",{"$f":"IF(G330=\"poniżej min.\",((VLOOKUP(E330,'Siatka płac'!$B$6:$D$17,3,FALSE)-C330)*(13-'Zestawienie stanowisk'!$H$1)),\"-\")","v":"-"}]
[1,"Monter",3500,"Pracownik 327",{"$f":"IFERROR((VLOOKUP(B331,'Zestawienie stanowisk'!$B$5:$E$65,4,FALSE)),\"-\")","v":1},{"$f":"IFERROR(((C331-(VLOOKUP(E331,'Siatka płac'!$B$6:$E$17,3,FALSE)))/(VLOOKUP(E331,'Siatka płac'!$B$6:$E$17,4,FALSE)-VLOOKUP(E331,'Siatka płac'!$B$6:$E$17,3,FALSE))),\"-\")","v":0.75},"III",{"$f":"IF(G331=\"poniżej min.\",((VLOOKUP(E331,'Siatka płac'!$B$6:$D$17,3,FALSE)-C331)*(13-'Zestawienie stanowisk'!$H$1)),\"-\")","v":"-"}]
[1,"Monter",3500,"Pracownik 328",{"$f":"IFERROR((VLOOKUP(B332,'Zestawienie stanowisk'!$B$5:$E$65,4,FALSE)),\"-\")","v":1},{"$f":"IFERROR(((C332-(VLOOKUP(E332,'Siatka płac'!$B$6:$E$17,3,FALSE)))/(VLOOKUP(E332,'Siatka płac'!$B$6:$E$17,4,FALSE)-VLOOKUP(E332,'Siatka płac'!$B$6:$E$17,3,FALSE))),\"-\")","v":0.75},"III",{"$f":"IF(G332=\"poniżej min.\",((VLOOKUP(E332,'Siatka płac'!$B$6:$D$17,3,FALSE)-C332)*(13-'Zestawienie stanowisk'!$H$1)),\"-\")","v":"-"}]
[1,"Monter",3500,"Pracownik 329",{"$f":"IFERROR((VLOOKUP(B333,'Zestawienie stanowisk'!$B$5:$E$65,4,FALSE)),\"-\")","v":1},{"$f":"IFERROR(((C333-(VLOOKUP(E333,'Siatka płac'!$B$6:$E$17,3,FALSE)))/(VLOOKUP(E333,'Siatka płac'!$B$6:$E$17,4,FALSE)-VLOOKUP(E333,'Siatka płac'!$B$6:$E$17,3,FALSE))),\"-\")","v":0.75},"III",{"$f":"IF(G333=\"poniżej min.\",((VLOOKUP(E333,'Siatka płac'!$B$6:$D$17,3,FALSE)-C333)*(13-'Zestawienie stanowisk'!$H$1)),\"-\")","v":"-"}]
[1,"Monter",3500,"Pracownik 330",{"$f":"IFERROR((VLOOKUP(B334,'Zestawienie stanowisk'!$B$5:$E$65,4,FALSE)),\"-\")","v":1},{"$f":"IFERROR(((C334-(VLOOKUP(E334,'Siatka płac'!$B$6:$E$17,3,FALSE)))/(VLOOKUP(E334,'Siatka płac'!$B$6:$E$17,4,FALSE)-VLOOKUP(E334,'Siatka płac'!$B$6:$E$17,3,FALSE))),\"-\")","v":0.75},"III",{"$f":"IF(G334=\"poniżej min.\",((VLOOKUP(E334,'Siatka płac'!$B$6:$D$17,3,FALSE)-C334)*(13-'Zestawienie stanowisk'!$H$1)),\"-\")","v":"-"}]
[1,"Monter",3500,"Pracownik 331",{"$f":"IFERROR((VLOOKUP(B335,'Zestawienie stanowisk'!$B$5:$E$65,4,FALSE)),\"-\")","v":1},{"$f":"IFERROR(((C335-(VLOOKUP(E335,'Siatka płac'!$B$6:$E$17,3,FALSE)))/(VLOOKUP(E335,'Siatka płac'!$B$6:$E$17,4,FALSE)-VLOOKUP(E335,'Siatka płac'!$B$6:$E$17,3,FALSE))),\"-\")","v":0.75},"III",{"$f":"IF(G335=\"poniżej min.\",((VLOOKUP(E335,'Siatka płac'!$B$6:$D$17,3,FALSE)-C335)*(13-'Zestawienie stanowisk'!$H$1)),\"-\")","v":"-"}]
[1,"Monter",3500,"Pracownik 332",{"$f":"IFERROR((VLOOKUP(B336,'Zestawienie stanowisk'!$B$5:$E$65,4,FALSE)),\"-\")","v":1},{"$f":"IFERROR(((C336-(VLOOKUP(E336,'Siatka płac'!$B$6:$E$17,3,FALSE)))/(VLOOKUP(E336,'Siatka płac'!$B$6:$E$17,4,FALSE)-VLOOKUP(E336,'Siatka płac'!$B$6:$E$17,3,FALSE))),\"-\")","v":0.75},"III",{"$f":"IF(G336=\"poniżej min.\",((VLOOKUP(E336,'Siatka płac'!$B$6:$D$17,3,FALSE)-C336)*(13-'Zestawienie stanowisk'!$H$1)),\"-\")","v":"-"}]
[1,"Monter",3500,"Pracownik 333",{"$f":"IFERROR((VLOOKUP(B337,'Zestawienie stanowisk'!$B$5:$E$65,4,FALSE)),\"-\")","v":1},{"$f":"IFERROR(((C337-(VLOOKUP(E337,'Siatka płac'!$B$6:$E$17,3,FALSE)))/(VLOOKUP(E337,'Siatka płac'!$B$6:$E$17,4,FALSE)-VLOOKUP(E337,'Siatka płac'!$B$6:$E$17,3,FALSE))),\"-\")","v":0.75},"III",{"$f":"IF(G337=\"poniżej min.\",((VLOOKUP(E337,'Siatka płac'!$B$6:$D$17,3,FALSE)-C337)*(13-'Zestawienie stanowisk'!$H$1)),\"-\")","v":"-"}]
[1,"Monter",3500,"Pracownik 334",{"$f":"IFERROR((VLOOKUP(B338,'Zestawienie stanowisk'!$B$5:$E$65,4,FALSE)),\"-\")","v":1},{"$f":"IFERROR(((C338-(VLOOKUP(E338,'Siatka płac'!$B$6:$E$17,3,FALSE)))/(VLOOKUP(E338,'Siatka płac'!$B$6:$E$17,4,FALSE)-VLOOKUP(E338,'Siatka płac'!$B$6:$E$17,3,FALSE))),\"-\")","v":0.75},"III",{"$f":"IF(G338=\"poniżej min.\",((VLOOKUP(E338,'Siatka płac'!$B$6:$D$17,3,FALSE)-C338)*(13-'Zestawienie stanowisk'!$H$1)),\"-\")","v":"-"}]
[1,"Monter",3500,"Pracownik 335",{"$f":"IFERROR((VLOOKUP(B339,'Zestawienie stanowisk'!$B$5:$E$65,4,FALSE)),\"-\")","v":1},{"$f":"IFERROR(((C339-(VLOOKUP(E339,'Siatka płac'!$B$6:$E$17,3,FALSE)))/(VLOOKUP(E339,'Siatka płac'!$B$6:$E$17,4,FALSE)-VLOOKUP(E339,'Siatka płac'!$B$6:$E$17,3,FALSE))),\"-\")","v":0.75},"III",{"$f":"IF(G339=\"poniżej min.\",((VLOOKUP(E339,'Siatka płac'!$B$6:$D$17,3,FALSE)-C339)*(13-'Zestawienie stanowisk'!$H$1)),\"-\")","v":"-"}]
[1,"Monter",3500,"Pracownik 336",{"$f":"IFERROR((VLOOKUP(B340,'Zestawienie stanowisk'!$B$5:$E$65,4,FALSE)),\"-\")","v":1},{"$f":"IFERROR(((C340-(VLOOKUP(E340,'Siatka płac'!$B$6:$E$17,3,FALSE)))/(VLOOKUP(E340,'Siatka płac'!$B$6:$E$17,4,FALSE)-VLOOKUP(E340,'Siatka płac'!$B$6:$E$17,3,FALSE))),\"-\")","v":0.75},"III",{"$f":"IF(G340=\"poniżej min.\",((VLOOKUP(E340,'Siatka płac'!$B$6:$D$17,3,FALSE)-C340)*(13-'Zestawienie stanowisk'!$H$1)),\"-\")","v":"-"}]
[1,"Monter",3500,"Pracownik 337",{"$f":"IFERROR((VLOOKUP(B341,'Zestawienie stanowisk'!$B$5:$E$65,4,FALSE)),\"-\")","v":1},{"$f":"IFERROR(((C341-(VLOOKUP(E341,'Siatka płac'!$B$6:$E$17,3,FALSE)))/(VLOOKUP(E341,'Siatka płac'!$B$6:$E$17,4,FALSE)-VLOOKUP(E341,'Siatka płac'!$B$6:$E$17,3,FALSE))),\"-\")","v":0.75},"III",{"$f":"IF(G341=\"poniżej min.\",((VLOOKUP(E341,'Siatka płac'!$B$6:$D$17,3,FALSE)-C341)*(13-'Zestawienie stanowisk'!$H$1)),\"-\")","v":"-"}]
[1,"Monter",3500,"Pracownik 338",{"$f":"IFERROR((VLOOKUP(B342,'Zestawienie stanowisk'!$B$5:$E$65,4,FALSE)),\"-\")","v":1},{"$f":"IFERROR(((C342-(VLOOKUP(E342,'Siatka płac'!$B$6:$E$17,3,FALSE)))/(VLOOKUP(E342,'Siatka płac'!$B$6:$E$17,4,FALSE)-VLOOKUP(E342,'Siatka płac'!$B$6:$E$17,3,FALSE))),\"-\")","v":0.75},"III",{"$f":"IF(G342=\"poniżej min.\",((VLOOKUP(E342,'Siatka płac'!$B$6:$D$17,3,FALSE)-C342)*(13-'Zestawienie stanowisk'!$H$1)),\"-\")","v":"-"}]
[1,"Monter",3500,"Pracownik 339",{"$f":"IFERROR((VLOOKUP(B343,'Zestawienie stanowisk'!$B$5:$E$65,4,FALSE)),\"-\")","v":1},{"$f":"IFERROR(((C343-(VLOOKUP(E343,'Siatka płac'!$B$6:$E$17,3,FALSE)))/(VLOOKUP(E343,'Siatka płac'!$B$6:$E$17,4,FALSE)-VLOOKUP(E343,'Siatka płac'!$B$6:$E$17,3,FALSE))),\"-\")","v":0.75},"III",{"$f":"IF(G343=\"poniżej min.\",((VLOOKUP(E343,'Siatka płac'!$B$6:$D$17,3,FALSE)-C343)*(13-'Zestawienie stanowisk'!$H$1)),\"-\")","v":"-"}]
[1,"Monter",3500,"Pracownik 340",{"$f":"IFERROR((VLOOKUP(B344,'Zestawienie stanowisk'!$B$5:$E$65,4,FALSE)),\"-\")","v":1},{"$f":"IFERROR(((C344-(VLOOKUP(E344,'Siatka płac'!$B$6:$E$17,3,FALSE)))/(VLOOKUP(E344,'Siatka płac'!$B$6:$E$17,4,FALSE)-VLOOKUP(E344,'Siatka płac'!$B$6:$E$17,3,FALSE))),\"-\")","v":0.75},"III",{"$f":"IF(G344=\"poniżej min.\",((VLOOKUP(E344,'Siatka płac'!$B$6:$D$17,3,FALSE)-C344)*(13-'Zestawienie stanowisk'!$H$1)),\"-\")","v":"-"}]
[1,"Monter",3500,"Pracownik 341",{"$f":"IFERROR((VLOOKUP(B345,'Zestawienie stanowisk'!$B$5:$E$65,4,FALSE)),\"-\")","v":1},{"$f":"IFERROR(((C345-(VLOOKUP(E345,'Siatka płac'!$B$6:$E$17,3,FALSE)))/(VLOOKUP(E345,'Siatka płac'!$B$6:$E$17,4,FALSE)-VLOOKUP(E345,'Siatka płac'!$B$6:$E$17,3,FALSE))),\"-\")","v":0.75},"III",{"$f":"IF(G345=\"poniżej min.\",((VLOOKUP(E345,'Siatka płac'!$B$6:$D$17,3,FALSE)-C345)*(13-'Zestawienie stanowisk'!$H$1)),\"-\")","v":"-"}]
[1,"Monter",3500,"Pracownik 342",{"$f":"IFERROR((VLOOKUP(B346,'Zestawienie stanowisk'!$B$5:$E$65,4,FALSE)),\"-\")","v":1},{"$f":"IFERROR(((C346-(VLOOKUP(E346,'Siatka płac'!$B$6:$E$17,3,FALSE)))/(VLOOKUP(E346,'Siatka płac'!$B$6:$E$17,4,FALSE)-VLOOKUP(E346,'Siatka płac'!$B$6:$E$17,3,FALSE))),\"-\")","v":0.75},"III",{"$f":"IF(G346=\"poniżej min.\",((VLOOKUP(E346,'Siatka płac'!$B$6:$D$17,3,FALSE)-C346)*(13-'Zestawienie stanowisk'!$H$1)),\"-\")","v":"-"}]
[1,"Monter",3500,"Pracownik 343",{"$f":"IFERROR((VLOOKUP(B347,'Zestawienie stanowisk'!$B$5:$E$65,4,FALSE)),\"-\")","v":1},{"$f":"IFERROR(((C347-(VLOOKUP(E347,'Siatka płac'!$B$6:$E$17,3,FALSE)))/(VLOOKUP(E347,'Siatka płac'!$B$6:$E$17,4,FALSE)-VLOOKUP(E347,'Siatka płac'!$B$6:$E$17,3,FALSE))),\"-\")","v":0.75},"III",{"$f":"IF(G347=\"poniżej min.\",((VLOOKUP(E347,'Siatka płac'!$B$6:$D$17,3,FALSE)-C347)*(13-'Zestawienie stanowisk'!$H$1)),\"-\")","v":"-"}]
[1,"Monter",3500,"Pracownik 344",{"$f":"IFERROR((VLOOKUP(B348,'Zestawienie stanowisk'!$B$5:$E$65,4,FALSE)),\"-\")","v":1},{"$f":"IFERROR(((C348-(VLOOKUP(E348,'Siatka płac'!$B$6:$E$17,3,FALSE)))/(VLOOKUP(E348,'Siatka płac'!$B$6:$E$17,4,FALSE)-VLOOKUP(E348,'Siatka płac'!$B$6:$E$17,3,FALSE))),\"-\")","v":0.75},"III",{"$f":"IF(G348=\"poniżej min.\",((VLOOKUP(E348,'Siatka płac'!$B$6:$D$17,3,FALSE)-C348)*(13-'Zestawienie stanowisk'!$H$1)),\"-\")","v":"-"}]
[1,"Monter",3500,"Pracownik 345",{"$f":"IFERROR((VLOOKUP(B349,'Zestawienie stanowisk'!$B$5:$E$65,4,FALSE)),\"-\")","v":1},{"$f":"IFERROR(((C349-(VLOOKUP(E349,'Siatka płac'!$B$6:$E$17,3,FALSE)))/(VLOOKUP(E349,'Siatka płac'!$B$6:$E$17,4,FALSE)-VLOOKUP(E349,'Siatka płac'!$B$6:$E$17,3,FALSE))),\"-\")","v":0.75},"III",{"$f":"IF(G349=\"poniżej min.\",((VLOOKUP(E349,'Siatka płac'!$B$6:$D$17,3,FALSE)-C349)*(13-'Zestawienie stanowisk'!$H$1)),\"-\")","v":"-"}]
[1,"Monter",3500,"Pracownik 346",{"$f":"IFERROR((VLOOKUP(B350,'Zestawienie stanowisk'!$B$5:$E$65,4,FALSE)),\"-\")","v":1},{"$f":"IFERROR(((C350-(VLOOKUP(E350,'Siatka płac'!$B$6:$E$17,3,FALSE)))/(VLOOKUP(E350,'Siatka płac'!$B$6:$E$17,4,FALSE)-VLOOKUP(E350,'Siatka płac'!$B$6:$E$17,3,FALSE))),\"-\")","v":0.75},"III",{"$f":"IF(G350=\"poniżej min.\",((VLOOKUP(E350,'Siatka płac'!$B$6:$D$17,3,FALSE)-C350)*(13-'Zestawienie stanowisk'!$H$1)),\"-\")","v":"-"}]
[1,"Monter",3500,"Pracownik 347",{"$f":"IFERROR((VLOOKUP(B351,'Zestawienie stanowisk'!$B$5:$E$65,4,FALSE)),\"-\")","v":1},{"$f":"IFERROR(((C351-(VLOOKUP(E351,'Siatka płac'!$B$6:$E$17,3,FALSE)))/(VLOOKUP(E351,'Siatka płac'!$B$6:$E$17,4,FALSE)-VLOOKUP(E351,'Siatka płac'!$B$6:$E$17,3,FALSE))),\"-\")","v":0.75},"III",{"$f":"IF(G351=\"poniżej min.\",((VLOOKUP(E351,'Siatka płac'!$B$6:$D$17,3,FALSE)-C351)*(13-'Zestawienie stanowisk'!$H$1)),\"-\")","v":"-"}]
[1,"Monter",3500,"Pracownik 348",{"$f":"IFERROR((VLOOKUP(B352,'Zestawienie stanowisk'!$B$5:$E$65,4,FALSE)),\"-\")","v":1},{"$f":"IFERROR(((C352-(VLOOKUP(E352,'Siatka płac'!$B$6:$E$17,3,FALSE)))/(VLOOKUP(E352,'Siatka płac'!$B$6:$E$17,4,FALSE)-VLOOKUP(E352,'Siatka płac'!$B$6:$E$17,3,FALSE))),\"-\")","v":0.75},"III",{"$f":"IF(G352=\"poniżej min.\",((VLOOKUP(E352,'Siatka płac'!$B$6:$D$17,3,FALSE)-C352)*(13-'Zestawienie stanowisk'!$H$1)),\"-\")","v":"-"}]
[1,"Monter",3500,"Pracownik 349",{"$f":"IFERROR((VLOOKUP(B353,'Zestawienie stanowisk'!$B$5:$E$65,4,FALSE)),\"-\")","v":1},{"$f":"IFERROR(((C353-(VLOOKUP(E353,'Siatka płac'!$B$6:$E$17,3,FALSE)))/(VLOOKUP(E353,'Siatka płac'!$B$6:$E$17,4,FALSE)-VLOOKUP(E353,'Siatka płac'!$B$6:$E$17,3,FALSE))),\"-\")","v":0.75},"III",{"$f":"IF(G353=\"poniżej min.\",((VLOOKUP(E353,'Siatka płac'!$B$6:$D$17,3,FALSE)-C353)*(13-'Zestawienie stanowisk'!$H$1)),\"-\")","v":"-"}]
[1,"Monter",3500,"Pracownik 350",{"$f":"IFERROR((VLOOKUP(B354,'Zestawienie stanowisk'!$B$5:$E$65,4,FALSE)),\"-\")","v":1},{"$f":"IFERROR(((C354-(VLOOKUP(E354,'Siatka płac'!$B$6:$E$17,3,FALSE)))/(VLOOKUP(E354,'Siatka płac'!$B$6:$E$17,4,FALSE)-VLOOKUP(E354,'Siatka płac'!$B$6:$E$17,3,FALSE))),\"-\")","v":0.75},"III",{"$f":"IF(G354=\"poniżej min.\",((VLOOKUP(E354,'Siatka płac'!$B$6:$D$17,3,FALSE)-C354)*(13-'Zestawienie stanowisk'!$H$1)),\"-\")","v":"-"}]
[1,"Operator",2500,"Pracownik 351",{"$f":"IFERROR((VLOOKUP(B355,'Zestawienie stanowisk'!$B$5:$E$65,4,FALSE)),\"-\")","v":1},{"$f":"IFERROR(((C355-(VLOOKUP(E355,'Siatka płac'!$B$6:$E$17,3,FALSE)))/(VLOOKUP(E355,'Siatka płac'!$B$6:$E$17,4,FALSE)-VLOOKUP(E355,'Siatka płac'!$B$6:$E$17,3,FALSE))),\"-\")","v":0.25},"I",{"$f":"IF(G355=\"poniżej min.\",((VLOOKUP(E355,'Siatka płac'!$B$6:$D$17,3,FALSE)-C355)*(13-'Zestawienie stanowisk'!$H$1)),\"-\")","v":"-"}]
[1,"Operator",2500,"Pracownik 352",{"$f":"IFERROR((VLOOKUP(B356,'Zestawienie stanowisk'!$B$5:$E$65,4,FALSE)),\"-\")","v":1},{"$f":"IFERROR(((C356-(VLOOKUP(E356,'Siatka płac'!$B$6:$E$17,3,FALSE)))/(VLOOKUP(E356,'Siatka płac'!$B$6:$E$17,4,FALSE)-VLOOKUP(E356,'Siatka płac'!$B$6:$E$17,3,FALSE))),\"-\")","v":0.25},"I",{"$f":"IF(G356=\"poniżej min.\",((VLOOKUP(E356,'Siatka płac'!$B$6:$D$17,3,FALSE)-C356)*(13-'Zestawienie stanowisk'!$H$1)),\"-\")","v":"-"}]
[1,"Operator",2500,"Pracownik 353",{"$f":"IFERROR((VLOOKUP(B357,'Zestawienie stanowisk'!$B$5:$E$65,4,FALSE)),\"-\")","v":1},{"$f":"IFERROR(((C357-(VLOOKUP(E357,'Siatka płac'!$B$6:$E$17,3,FALSE)))/(VLOOKUP(E357,'Siatka płac'!$B$6:$E$17,4,FALSE)-VLOOKUP(E357,'Siatka płac'!$B$6:$E$17,3,FALSE))),\"-\")","v":0.25},"I",{"$f":"IF(G357=\"poniżej min.\",((VLOOKUP(E357,'Siatka płac'!$B$6:$D$17,3,FALSE)-C357)*(13-'Zestawienie stanowisk'!$H$1)),\"-\")","v":"-"}]
[1,"Operator",2500,"Pracownik 354",{"$f":"IFERROR((VLOOKUP(B358,'Zestawienie stanowisk'!$B$5:$E$65,4,FALSE)),\"-\")","v":1},{"$f":"IFERROR(((C358-(VLOOKUP(E358,'Siatka płac'!$B$6:$E$17,3,FALSE)))/(VLOOKUP(E358,'Siatka płac'!$B$6:$E$17,4,FALSE)-VLOOKUP(E358,'Siatka płac'!$B$6:$E$17,3,FALSE))),\"-\")","v":0.25},"I",{"$f":"IF(G358=\"poniżej min.\",((VLOOKUP(E358,'Siatka płac'!$B$6:$D$17,3,FALSE)-C358)*(13-'Zestawienie stanowisk'!$H$1)),\"-\")","v":"-"}]
[1,"Operator",2500,"Pracownik 355",{"$f":"IFERROR((VLOOKUP(B359,'Zestawienie stanowisk'!$B$5:$E$65,4,FALSE)),\"-\")","v":1},{"$f":"IFERROR(((C359-(VLOOKUP(E359,'Siatka płac'!$B$6:$E$17,3,FALSE)))/(VLOOKUP(E359,'Siatka płac'!$B$6:$E$17,4,FALSE)-VLOOKUP(E359,'Siatka płac'!$B$6:$E$17,3,FALSE))),\"-\")","v":0.25},"I",{"$f":"IF(G359=\"poniżej min.\",((VLOOKUP(E359,'Siatka płac'!$B$6:$D$17,3,FALSE)-C359)*(13-'Zestawienie stanowisk'!$H$1)),\"-\")","v":"-"}]
[1,"Operator",2500,"Pracownik 356",{"$f":"IFERROR((VLOOKUP(B360,'Zestawienie stanowisk'!$B$5:$E$65,4,FALSE)),\"-\")","v":1},{"$f":"IFERROR(((C360-(VLOOKUP(E360,'Siatka płac'!$B$6:$E$17,3,FALSE)))/(VLOOKUP(E360,'Siatka płac'!$B$6:$E$17,4,FALSE)-VLOOKUP(E360,'Siatka płac'!$B$6:$E$17,3,FALSE))),\"-\")","v":0.25},"I",{"$f":"IF(G360=\"poniżej min.\",((VLOOKUP(E360,'Siatka płac'!$B$6:$D$17,3,FALSE)-C360)*(13-'Zestawienie stanowisk'!$H$1)),\"-\")","v":"-"}]
[1,"Operator",2500,"Pracownik 357",{"$f":"IFERROR((VLOOKUP(B361,'Zestawienie stanowisk'!$B$5:$E$65,4,FALSE)),\"-\")","v":1},{"$f":"IFERROR(((C361-(VLOOKUP(E361,'Siatka płac'!$B$6:$E$17,3,FALSE)))/(VLOOKUP(E361,'Siatka płac'!$B$6:$E$17,4,FALSE)-VLOOKUP(E361,'Siatka płac'!$B$6:$E$17,3,FALSE))),\"-\")","v":0.25},"I",{"$f":"IF(G361=\"poniżej min.\",((VLOOKUP(E361,'Siatka płac'!$B$6:$D$17,3,FALSE)-C361)*(13-'Zestawienie stanowisk'!$H$1)),\"-\")","v":"-"}]
[1,"Operator",2500,"Pracownik 358",{"$f":"IFERROR((VLOOKUP(B362,'Zestawienie stanowisk'!$B$5:$E$65,4,FALSE)),\"-\")","v":1},{"$f":"IFERROR(((C362-(VLOOKUP(E362,'Siatka płac'!$B$6:$E$17,3,FALSE)))/(VLOOKUP(E362,'Siatka płac'!$B$6:$E$17,4,FALSE)-VLOOKUP(E362,'Siatka płac'!$B$6:$E$17,3,FALSE))),\"-\")","v":0.25},"I",{"$f":"IF(G362=\"poniżej min.\",((VLOOKUP(E362,'Siatka płac'!$B$6:$D$17,3,FALSE)-C362)*(13-'Zestawienie stanowisk'!$H$1)),\"-\")","v":"-"}]
[1,"Operator",2500,"Pracownik 359",{"$f":"IFERROR((VLOOKUP(B363,'Zestawienie stanowisk'!$B$5:$E$65,4,FALSE)),\"-\")","v":1},{"$f":"IFERROR(((C363-(VLOOKUP(E363,'Siatka płac'!$B$6:$E$17,3,FALSE)))/(VLOOKUP(E363,'Siatka płac'!$B$6:$E$17,4,FALSE)-VLOOKUP(E363,'Siatka płac'!$B$6:$E$17,3,FALSE))),\"-\")","v":0.25},"I",{"$f":"IF(G363=\"poniżej min.\",((VLOOKUP(E363,'Siatka płac'!$B$6:$D$17,3,FALSE)-C363)*(13-'Zestawienie stanowisk'!$H$1)),\"-\")","v":"-"}]
[1,"Operator",2500,"Pracownik 360",{"$f":"IFERROR((VLOOKUP(B364,'Zestawienie stanowisk'!$B$5:$E$65,4,FALSE)),\"-\")","v":1},{"$f":"IFERROR(((C364-(VLOOKUP(E364,'Siatka płac'!$B$6:$E$17,3,FALSE)))/(VLOOKUP(E364,'Siatka płac'!$B$6:$E$17,4,FALSE)-VLOOKUP(E364,'Siatka płac'!$B$6:$E$17,3,FALSE))),\"-\")","v":0.25},"I",{"$f":"IF(G364=\"poniżej min.\",((VLOOKUP(E364,'Siatka płac'!$B$6:$D$17,3,FALSE)-C364)*(13-'Zestawienie stanowisk'!$H$1)),\"-\")","v":"-"}]
[1,"Operator",2500,"Pracownik 361",{"$f":"IFERROR((VLOOKUP(B365,'Zestawienie stanowisk'!$B$5:$E$65,4,FALSE)),\"-\")","v":1},{"$f":"IFERROR(((C365-(VLOOKUP(E365,'Siatka płac'!$B$6:$E$17,3,FALSE)))/(VLOOKUP(E365,'Siatka płac'!$B$6:$E$17,4,FALSE)-VLOOKUP(E365,'Siatka płac'!$B$6:$E$17,3,FALSE))),\"-\")","v":0.25},"I",{"$f":"IF(G365=\"poniżej min.\",((VLOOKUP(E365,'Siatka płac'!$B$6:$D$17,3,FALSE)-C365)*(13-'Zestawienie stanowisk'!$H$1)),\"-\")","v":"-"}]
[1,"Operator",2500,"Pracownik 362",{"$f":"IFERROR((VLOOKUP(B366,'Zestawienie stanowisk'!$B$5:$E$65,4,FALSE)),\"-\")","v":1},{"$f":"IFERROR(((C366-(VLOOKUP(E366,'Siatka płac'!$B$6:$E$17,3,FALSE)))/(VLOOKUP(E366,'Siatka płac'!$B$6:$E$17,4,FALSE)-VLOOKUP(E366,'Siatka płac'!$B$6:$E$17,3,FALSE))),\"-\")","v":0.25},"I",{"$f":"IF(G366=\"poniżej min.\",((VLOOKUP(E366,'Siatka płac'!$B$6:$D$17,3,FALSE)-C366)*(13-'Zestawienie stanowisk'!$H$1)),\"-\")","v":"-"}]
[1,"Operator",2500,"Pracownik 363",{"$f":"IFERROR((VLOOKUP(B367,'Zestawienie stanowisk'!$B$5:$E$65,4,FALSE)),\"-\")","v":1},{"$f":"IFERROR(((C367-(VLOOKUP(E367,'Siatka płac'!$B$6:$E$17,3,FALSE)))/(VLOOKUP(E367,'Siatka płac'!$B$6:$E$17,4,FALSE)-VLOOKUP(E367,'Siatka płac'!$B$6:$E$17,3,FALSE))),\"-\")","v":0.25},"I",{"$f":"IF(G367=\"poniżej min.\",((VLOOKUP(E367,'Siatka płac'!$B$6:$D$17,3,FALSE)-C367)*(13-'Zestawienie stanowisk'!$H$1)),\"-\")","v":"-"}]
[1,"Operator",2500,"Pracownik 364",{"$f":"IFERROR((VLOOKUP(B368,'Zestawienie stanowisk'!$B$5:$E$65,4,FALSE)),\"-\")","v":1},{"$f":"IFERROR(((C368-(VLOOKUP(E368,'Siatka płac'!$B$6:$E$17,3,FALSE)))/(VLOOKUP(E368,'Siatka płac'!$B$6:$E$17,4,FALSE)-VLOOKUP(E368,'Siatka płac'!$B$6:$E$17,3,FALSE))),\"-\")","v":0.25},"I",{"$f":"IF(G368=\"poniżej min.\",((VLOOKUP(E368,'Siatka płac'!$B$6:$D$17,3,FALSE)-C368)*(13-'Zestawienie stanowisk'!$H$1)),\"-\")","v":"-"}]
[1,"Operator",2500,"Pracownik 365",{"$f":"IFERROR((VLOOKUP(B369,'Zestawienie stanowisk'!$B$5:$E$65,4,FALSE)),\"-\")","v":1},{"$f":"IFERROR(((C369-(VLOOKUP(E369,'Siatka płac'!$B$6:$E$17,3,FALSE)))/(VLOOKUP(E369,'Siatka płac'!$B$6:$E$17,4,FALSE)-VLOOKUP(E369,'Siatka płac'!$B$6:$E$17,3,FALSE))),\"-\")","v":0.25},"I",{"$f":"IF(G369=\"poniżej min.\",((VLOOKUP(E369,'Siatka płac'!$B$6:$D$17,3,FALSE)-C369)*(13-'Zestawienie stanowisk'!$H$1)),\"-\")","v":"-"}]
[1,"Operator",2500,"Pracownik 366",{"$f":"IFERROR((VLOOKUP(B370,'Zestawienie stanowisk'!$B$5:$E$65,4,FALSE)),\"-\")","v":1},{"$f":"IFERROR(((C370-(VLOOKUP(E370,'Siatka płac'!$B$6:$E$17,3,FALSE)))/(VLOOKUP(E370,'Siatka płac'!$B$6:$E$17,4,FALSE)-VLOOKUP(E370,'Siatka płac'!$B$6:$E$17,3,FALSE))),\"-\")","v":0.25},"I",{"$f":"IF(G370=\"poniżej min.\",((VLOOKUP(E370,'Siatka płac'!$B$6:$D$17,3,FALSE)-C370)*(13-'Zestawienie stanowisk'!$H$1)),\"-\")","v":"-"}]
[1,"Operator",2500,"Pracownik 367",{"$f":"IFERROR((VLOOKUP(B371,'Zestawienie stanowisk'!$B$5:$E$65,4,FALSE)),\"-\")","v":1},{"$f":"IFERROR(((C371-(VLOOKUP(E371,'Siatka płac'!$B$6:$E$17,3,FALSE)))/(VLOOKUP(E371,'Siatka płac'!$B$6:$E$17,4,FALSE)-VLOOKUP(E371,'Siatka płac'!$B$6:$E$17,3,FALSE))),\"-\")","v":0.25},"I",{"$f":"IF(G371=\"poniżej min.\",((VLOOKUP(E371,'Siatka płac'!$B$6:$D$17,3,FALSE)-C371)*(13-'Zestawienie stanowisk'!$H$1)),\"-\")","v":"-"}]
[1,"Operator",2500,"Pracownik 368",{"$f":"IFERROR((VLOOKUP(B372,'Zestawienie stanowisk'!$B$5:$E$65,4,FALSE)),\"-\")","v":1},{"$f":"IFERROR(((C372-(VLOOKUP(E372,'Siatka płac'!$B$6:$E$17,3,FALSE)))/(VLOOKUP(E372,'Siatka płac'!$B$6:$E$17,4,FALSE)-VLOOKUP(E372,'Siatka płac'!$B$6:$E$17,3,FALSE))),\"-\")","v":0.25},"I",{"$f":"IF(G372=\"poniżej min.\",((VLOOKUP(E372,'Siatka płac'!$B$6:$D$17,3,FALSE)-C372)*(13-'Zestawienie stanowisk'!$H$1)),\"-\")","v":"-"}]
[1,"Operator",2500,"Pracownik 369",{"$f":"IFERROR((VLOOKUP(B373,'Zestawienie stanowisk'!$B$5:$E$65,4,FALSE)),\"-\")","v":1},{"$f":"IFERROR(((C373-(VLOOKUP(E373,'Siatka płac'!$B$6:$E$17,3,FALSE)))/(VLOOKUP(E373,'Siatka płac'!$B$6:$E$17,4,FALSE)-VLOOKUP(E373,'Siatka płac'!$B$6:$E$17,3,FALSE))),\"-\")","v":0.25},"I",{"$f":"IF(G373=\"poniżej min.\",((VLOOKUP(E373,'Siatka płac'!$B$6:$D$17,3,FALSE)-C373)*(13-'Zestawienie stanowisk'!$H$1)),\"-\")","v":"-"}]
[1,"Operator",2800,"Pracownik 370",{"$f":"IFERROR((VLOOKUP(B374,'Zestawienie stanowisk'!$B$5:$E$65,4,FALSE)),\"-\")","v":1},{"$f":"IFERROR(((C374-(VLOOKUP(E374,'Siatka płac'!$B$6:$E$17,3,FALSE)))/(VLOOKUP(E374,'Siatka płac'!$B$6:$E$17,4,FALSE)-VLOOKUP(E374,'Siatka płac'!$B$6:$E$17,3,FALSE))),\"-\")","v":0.4},"II",{"$f":"IF(G374=\"poniżej min.\",((VLOOKUP(E374,'Siatka płac'!$B$6:$D$17,3,FALSE)-C374)*(13-'Zestawienie stanowisk'!$H$1)),\"-\")","v":"-"}]
[1,"Operator",2800,"Pracownik 371",{"$f":"IFERROR((VLOOKUP(B375,'Zestawienie stanowisk'!$B$5:$E$65,4,FALSE)),\"-\")","v":1},{"$f":"IFERROR(((C375-(VLOOKUP(E375,'Siatka płac'!$B$6:$E$17,3,FALSE)))/(VLOOKUP(E375,'Siatka płac'!$B$6:$E$17,4,FALSE)-VLOOKUP(E375,'Siatka płac'!$B$6:$E$17,3,FALSE))),\"-\")","v":0.4},"II",{"$f":"IF(G375=\"poniżej min.\",((VLOOKUP(E375,'Siatka płac'!$B$6:$D$17,3,FALSE)-C375)*(13-'Zestawienie stanowisk'!$H$1)),\"-\")","v":"-"}]
[1,"Operator",2800,"Pracownik 372",{"$f":"IFERROR((VLOOKUP(B376,'Zestawienie stanowisk'!$B$5:$E$65,4,FALSE)),\"-\")","v":1},{"$f":"IFERROR(((C376-(VLOOKUP(E376,'Siatka płac'!$B$6:$E$17,3,FALSE)))/(VLOOKUP(E376,'Siatka płac'!$B$6:$E$17,4,FALSE)-VLOOKUP(E376,'Siatka płac'!$B$6:$E$17,3,FALSE))),\"-\")","v":0.4},"II",{"$f":"IF(G376=\"poniżej min.\",((VLOOKUP(E376,'Siatka płac'!$B$6:$D$17,3,FALSE)-C376)*(13-'Zestawienie stanowisk'!$H$1)),\"-\")","v":"-"}]
[1,"Operator",2800,"Pracownik 373",{"$f":"IFERROR((VLOOKUP(B377,'Zestawienie stanowisk'!$B$5:$E$65,4,FALSE)),\"-\")","v":1},{"$f":"IFERROR(((C377-(VLOOKUP(E377,'Siatka płac'!$B$6:$E$17,3,FALSE)))/(VLOOKUP(E377,'Siatka płac'!$B$6:$E$17,4,FALSE)-VLOOKUP(E377,'Siatka płac'!$B$6:$E$17,3,FALSE))),\"-\")","v":0.4},"II",{"$f":"IF(G377=\"poniżej min.\",((VLOOKUP(E377,'Siatka płac'!$B$6:$D$17,3,FALSE)-C377)*(13-'Zestawienie stanowisk'!$H$1)),\"-\")","v":"-"}]
[1,"Operator",2800,"Pracownik 374",{"$f":"IFERROR((VLOOKUP(B378,'Zestawienie stanowisk'!$B$5:$E$65,4,FALSE)),\"-\")","v":1},{"$f":"IFERROR(((C378-(VLOOKUP(E378,'Siatka płac'!$B$6:$E$17,3,FALSE)))/(VLOOKUP(E378,'Siatka płac'!$B$6:$E$17,4,FALSE)-VLOOKUP(E378,'Siatka płac'!$B$6:$E$17,3,FALSE))),\"-\")","v":0.4},"II",{"$f":"IF(G378=\"poniżej min.\",((VLOOKUP(E378,'Siatka płac'!$B$6:$D$17,3,FALSE)-C378)*(13-'Zestawienie stanowisk'!$H$1)),\"-\")","v":"-"}]
[1,"Operator",2800,"Pracownik 375",{"$f":"IFERROR((VLOOKUP(B379,'Zestawienie stanowisk'!$B$5:$E$65,4,FALSE)),\"-\")","v":1},{"$f":"IFERROR(((C379-(VLOOKUP(E379,'Siatka płac'!$B$6:$E$17,3,FALSE)))/(VLOOKUP(E379,'Siatka płac'!$B$6:$E$17,4,FALSE)-VLOOKUP(E379,'Siatka płac'!$B$6:$E$17,3,FALSE))),\"-\")","v":0.4},"II",{"$f":"IF(G379=\"poniżej min.\",((VLOOKUP(E379,'Siatka płac'!$B$6:$D$17,3,FALSE)-C379)*(13-'Zestawienie stanowisk'!$H$1)),\"-\")","v":"-"}]
[1,"Operator",2800,"Pracownik 376",{"$f":"IFERROR((VLOOKUP(B380,'Zestawienie stanowisk'!$B$5:$E$65,4,FALSE)),\"-\")","v":1},{"$f":"IFERROR(((C380-(VLOOKUP(E380,'Siatka płac'!$B$6:$E$17,3,FALSE)))/(VLOOKUP(E380,'Siatka płac'!$B$6:$E$17,4,FALSE)-VLOOKUP(E380,'Siatka płac'!$B$6:$E$17,3,FALSE))),\"-\")","v":0.4},"II",{"$f":"IF(G380=\"poniżej min.\",((VLOOKUP(E380,'Siatka płac'!$B$6:$D$17,3,FALSE)-C380)*(13-'Zestawienie stanowisk'!$H$1)),\"-\")","v":"-"}]
[1,"Operator",2800,"Pracownik 377",{"$f":"IFERROR((VLOOKUP(B381,'Zestawienie stanowisk'!$B$5:$E$65,4,FALSE)),\"-\")","v":1},{"$f":"IFERROR(((C381-(VLOOKUP(E381,'Siatka płac'!$B$6:$E$17,3,FALSE)))/(VLOOKUP(E381,'Siatka płac'!$B$6:$E$17,4,FALSE)-VLOOKUP(E381,'Siatka płac'!$B$6:$E$17,3,FALSE))),\"-\")","v":0.4},"II",{"$f":"IF(G381=\"poniżej min.\",((VLOOKUP(E381,'Siatka płac'!$B$6:$D$17,3,FALSE)-C381)*(13-'Zestawienie stanowisk'!$H$1)),\"-\")","v":"-"}]
[1,"Operator",2800,"Pracownik 378",{"$f":"IFERROR((VLOOKUP(B382,'Zestawienie stanowisk'!$B$5:$E$65,4,FALSE)),\"-\")","v":1},{"$f":"IFERROR(((C382-(VLOOKUP(E382,'Siatka płac'!$B$6:$E$17,3,FALSE)))/(VLOOKUP(E382,'Siatka płac'!$B$6:$E$17,4,FALSE)-VLOOKUP(E382,'Siatka płac'!$B$6:$E$17,3,FALSE))),\"-\")","v":0.4},"II",{"$f":"IF(G382=\"poniżej min.\",((VLOOKUP(E382,'Siatka płac'!$B$6:$D$17,3,FALSE)-C382)*(13-'Zestawienie stanowisk'!$H$1)),\"-\")","v":"-"}]
[1,"Monter",3500,"Pracownik 379",{"$f":"IFERROR((VLOOKUP(B383,'Zestawienie stanowisk'!$B$5:$E$65,4,FALSE)),\"-\")","v":1},{"$f":"IFERROR(((C383-(VLOOKUP(E383,'Siatka płac'!$B$6:$E$17,3,FALSE)))/(VLOOKUP(E383,'Siatka płac'!$B$6:$E$17,4,FALSE)-VLOOKUP(E383,'Siatka płac'!$B$6:$E$17,3,FALSE))),\"-\")","v":0.75},"III",{"$f":"IF(G383=\"poniżej min.\",((VLOOKUP(E383,'Siatka płac'!$B$6:$D$17,3,FALSE)-C383)*(13-'Zestawienie stanowisk'!$H$1)),\"-\")","v":"-"}]
[1,"Monter",3500,"Pracownik 380",{"$f":"IFERROR((VLOOKUP(B384,'Zestawienie stanowisk'!$B$5:$E$65,4,FALSE)),\"-\")","v":1},{"$f":"IFERROR(((C384-(VLOOKUP(E384,'Siatka płac'!$B$6:$E$17,3,FALSE)))/(VLOOKUP(E384,'Siatka płac'!$B$6:$E$17,4,FALSE)-VLOOKUP(E384,'Siatka płac'!$B$6:$E$17,3,FALSE))),\"-\")","v":0.75},"III",{"$f":"IF(G384=\"poniżej min.\",((VLOOKUP(E384,'Siatka płac'!$B$6:$D$17,3,FALSE)-C384)*(13-'Zestawienie stanowisk'!$H$1)),\"-\")","v":"-"}]
[1,"Monter",3500,"Pracownik 381",{"$f":"IFERROR((VLOOKUP(B385,'Zestawienie stanowisk'!$B$5:$E$65,4,FALSE)),\"-\")","v":1},{"$f":"IFERROR(((C385-(VLOOKUP(E385,'Siatka płac'!$B$6:$E$17,3,FALSE)))/(VLOOKUP(E385,'Siatka płac'!$B$6:$E$17,4,FALSE)-VLOOKUP(E385,'Siatka płac'!$B$6:$E$17,3,FALSE))),\"-\")","v":0.75},"III",{"$f":"IF(G385=\"poniżej min.\",((VLOOKUP(E385,'Siatka płac'!$B$6:$D$17,3,FALSE)-C385)*(13-'Zestawienie stanowisk'!$H$1)),\"-\")","v":"-"}]
[1,"Monter",2300,"Pracownik 382",{"$f":"IFERROR((VLOOKUP(B386,'Zestawienie stanowisk'!$B$5:$E$65,4,FALSE)),\"-\")","v":1},{"$f":"IFERROR(((C386-(VLOOKUP(E386,'Siatka płac'!$B$6:$E$17,3,FALSE)))/(VLOOKUP(E386,'Siatka płac'!$B$6:$E$17,4,FALSE)-VLOOKUP(E386,'Siatka płac'!$B$6:$E$17,3,FALSE))),\"-\")","v":0.15},"I",{"$f":"IF(G386=\"poniżej min.\",((VLOOKUP(E386,'Siatka płac'!$B$6:$D$17,3,FALSE)-C386)*(13-'Zestawienie stanowisk'!$H$1)),\"-\")","v":"-"}]
[1,"Monter",2300,"Pracownik 383",{"$f":"IFERROR((VLOOKUP(B387,'Zestawienie stanowisk'!$B$5:$E$65,4,FALSE)),\"-\")","v":1},{"$f":"IFERROR(((C387-(VLOOKUP(E387,'Siatka płac'!$B$6:$E$17,3,FALSE)))/(VLOOKUP(E387,'Siatka płac'!$B$6:$E$17,4,FALSE)-VLOOKUP(E387,'Siatka płac'!$B$6:$E$17,3,FALSE))),\"-\")","v":0.15},"I",{"$f":"IF(G387=\"poniżej min.\",((VLOOKUP(E387,'Siatka płac'!$B$6:$D$17,3,FALSE)-C387)*(13-'Zestawienie stanowisk'!$H$1)),\"-\")","v":"-"}]
[1,"Monter",2300,"Pracownik 384",{"$f":"IFERROR((VLOOKUP(B388,'Zestawienie stanowisk'!$B$5:$E$65,4,FALSE)),\"-\")","v":1},{"$f":"IFERROR(((C388-(VLOOKUP(E388,'Siatka płac'!$B$6:$E$17,3,FALSE)))/(VLOOKUP(E388,'Siatka płac'!$B$6:$E$17,4,FALSE)-VLOOKUP(E388,'Siatka płac'!$B$6:$E$17,3,FALSE))),\"-\")","v":0.15},"I",{"$f":"IF(G388=\"poniżej min.\",((VLOOKUP(E388,'Siatka płac'!$B$6:$D$17,3,FALSE)-C388)*(13-'Zestawienie stanowisk'!$H$1)),\"-\")","v":"-"}]
[{"$f":"IF(ISBLANK(B389),0,1)","v":1},"Monter",2300,"Pracownik 385",{"$f":"IFERROR((VLOOKUP(B389,'Zestawienie stanowisk'!$B$5:$E$65,4,FALSE)),\"-\")","v":1},{"$f":"IFERROR(((C389-(VLOOKUP(E389,'Siatka płac'!$B$6:$E$17,3,FALSE)))/(VLOOKUP(E389,'Siatka płac'!$B$6:$E$17,4,FALSE)-VLOOKUP(E389,'Siatka płac'!$B$6:$E$17,3,FALSE))),\"-\")","v":0.15},{"$f":"IFERROR((INDEX($N$5:$N$10,MATCH(F389,$M$5:$M$10,-1))),\"-\")","v":"I"},{"$f":"IF(G389=\"poniżej min.\",((VLOOKUP(E389,'Siatka płac'!$B$6:$D$17,3,FALSE)-C389)*(13-'Zestawienie stanowisk'!$H$1)),\"-\")","v":"-"}]
[1,"Monter",2300,"Pracownik 386",{"$f":"IFERROR((VLOOKUP(B390,'Zestawienie stanowisk'!$B$5:$E$65,4,FALSE)),\"-\")","v":1},{"$f":"IFERROR(((C390-(VLOOKUP(E390,'Siatka płac'!$B$6:$E$17,3,FALSE)))/(VLOOKUP(E390,'Siatka płac'!$B$6:$E$17,4,FALSE)-VLOOKUP(E390,'Siatka płac'!$B$6:$E$17,3,FALSE))),\"-\")","v":0.15},"I",{"$f":"IF(G390=\"poniżej min.\",((VLOOKUP(E390,'Siatka płac'!$B$6:$D$17,3,FALSE)-C390)*(13-'Zestawienie stanowisk'!$H$1)),\"-\")","v":"-"}]
[1,"Monter",2300,"Pracownik 387",{"$f":"IFERROR((VLOOKUP(B391,'Zestawienie stanowisk'!$B$5:$E$65,4,FALSE)),\"-\")","v":1},{"$f":"IFERROR(((C391-(VLOOKUP(E391,'Siatka płac'!$B$6:$E$17,3,FALSE)))/(VLOOKUP(E391,'Siatka płac'!$B$6:$E$17,4,FALSE)-VLOOKUP(E391,'Siatka płac'!$B$6:$E$17,3,FALSE))),\"-\")","v":0.15},"I",{"$f":"IF(G391=\"poniżej min.\",((VLOOKUP(E391,'Siatka płac'!$B$6:$D$17,3,FALSE)-C391)*(13-'Zestawienie stanowisk'!$H$1)),\"-\")","v":"-"}]
[1,"Monter",2300,"Pracownik 388",{"$f":"IFERROR((VLOOKUP(B392,'Zestawienie stanowisk'!$B$5:$E$65,4,FALSE)),\"-\")","v":1},{"$f":"IFERROR(((C392-(VLOOKUP(E392,'Siatka płac'!$B$6:$E$17,3,FALSE)))/(VLOOKUP(E392,'Siatka płac'!$B$6:$E$17,4,FALSE)-VLOOKUP(E392,'Siatka płac'!$B$6:$E$17,3,FALSE))),\"-\")","v":0.15},"I",{"$f":"IF(G392=\"poniżej min.\",((VLOOKUP(E392,'Siatka płac'!$B$6:$D$17,3,FALSE)-C392)*(13-'Zestawienie stanowisk'!$H$1)),\"-\")","v":"-"}]
[1,"Monter",2300,"Pracownik 389",{"$f":"IFERROR((VLOOKUP(B393,'Zestawienie stanowisk'!$B$5:$E$65,4,FALSE)),\"-\")","v":1},{"$f":"IFERROR(((C393-(VLOOKUP(E393,'Siatka płac'!$B$6:$E$17,3,FALSE)))/(VLOOKUP(E393,'Siatka płac'!$B$6:$E$17,4,FALSE)-VLOOKUP(E393,'Siatka płac'!$B$6:$E$17,3,FALSE))),\"-\")","v":0.15},"I",{"$f":"IF(G393=\"poniżej min.\",((VLOOKUP(E393,'Siatka płac'!$B$6:$D$17,3,FALSE)-C393)*(13-'Zestawienie stanowisk'!$H$1)),\"-\")","v":"-"}]
[1,"Monter",2300,"Pracownik 390",{"$f":"IFERROR((VLOOKUP(B394,'Zestawienie stanowisk'!$B$5:$E$65,4,FALSE)),\"-\")","v":1},{"$f":"IFERROR(((C394-(VLOOKUP(E394,'Siatka płac'!$B$6:$E$17,3,FALSE)))/(VLOOKUP(E394,'Siatka płac'!$B$6:$E$17,4,FALSE)-VLOOKUP(E394,'Siatka płac'!$B$6:$E$17,3,FALSE))),\"-\")","v":0.15},"I",{"$f":"IF(G394=\"poniżej min.\",((VLOOKUP(E394,'Siatka płac'!$B$6:$D$17,3,FALSE)-C394)*(13-'Zestawienie stanowisk'!$H$1)),\"-\")","v":"-"}]
[1,"Monter",2300,"Pracownik 391",{"$f":"IFERROR((VLOOKUP(B395,'Zestawienie stanowisk'!$B$5:$E$65,4,FALSE)),\"-\")","v":1},{"$f":"IFERROR(((C395-(VLOOKUP(E395,'Siatka płac'!$B$6:$E$17,3,FALSE)))/(VLOOKUP(E395,'Siatka płac'!$B$6:$E$17,4,FALSE)-VLOOKUP(E395,'Siatka płac'!$B$6:$E$17,3,FALSE))),\"-\")","v":0.15},"I",{"$f":"IF(G395=\"poniżej min.\",((VLOOKUP(E395,'Siatka płac'!$B$6:$D$17,3,FALSE)-C395)*(13-'Zestawienie stanowisk'!$H$1)),\"-\")","v":"-"}]
[1,"Monter",2300,"Pracownik 392",{"$f":"IFERROR((VLOOKUP(B396,'Zestawienie stanowisk'!$B$5:$E$65,4,FALSE)),\"-\")","v":1},{"$f":"IFERROR(((C396-(VLOOKUP(E396,'Siatka płac'!$B$6:$E$17,3,FALSE)))/(VLOOKUP(E396,'Siatka płac'!$B$6:$E$17,4,FALSE)-VLOOKUP(E396,'Siatka płac'!$B$6:$E$17,3,FALSE))),\"-\")","v":0.15},"I",{"$f":"IF(G396=\"poniżej min.\",((VLOOKUP(E396,'Siatka płac'!$B$6:$D$17,3,FALSE)-C396)*(13-'Zestawienie stanowisk'!$H$1)),\"-\")","v":"-"}]
[1,"Monter",2300,"Pracownik 393",{"$f":"IFERROR((VLOOKUP(B397,'Zestawienie stanowisk'!$B$5:$E$65,4,FALSE)),\"-\")","v":1},{"$f":"IFERROR(((C397-(VLOOKUP(E397,'Siatka płac'!$B$6:$E$17,3,FALSE)))/(VLOOKUP(E397,'Siatka płac'!$B$6:$E$17,4,FALSE)-VLOOKUP(E397,'Siatka płac'!$B$6:$E$17,3,FALSE))),\"-\")","v":0.15},"I",{"$f":"IF(G397=\"poniżej min.\",((VLOOKUP(E397,'Siatka płac'!$B$6:$D$17,3,FALSE)-C397)*(13-'Zestawienie stanowisk'!$H$1)),\"-\")","v":"-"}]
[1,"Monter",2300,"Pracownik 394",{"$f":"IFERROR((VLOOKUP(B398,'Zestawienie stanowisk'!$B$5:$E$65,4,FALSE)),\"-\")","v":1},{"$f":"IFERROR(((C398-(VLOOKUP(E398,'Siatka płac'!$B$6:$E$17,3,FALSE)))/(VLOOKUP(E398,'Siatka płac'!$B$6:$E$17,4,FALSE)-VLOOKUP(E398,'Siatka płac'!$B$6:$E$17,3,FALSE))),\"-\")","v":0.15},"I",{"$f":"IF(G398=\"poniżej min.\",((VLOOKUP(E398,'Siatka płac'!$B$6:$D$17,3,FALSE)-C398)*(13-'Zestawienie stanowisk'!$H$1)),\"-\")","v":"-"}]
[1,"Monter",2300,"Pracownik 395",{"$f":"IFERROR((VLOOKUP(B399,'Zestawienie stanowisk'!$B$5:$E$65,4,FALSE)),\"-\")","v":1},{"$f":"IFERROR(((C399-(VLOOKUP(E399,'Siatka płac'!$B$6:$E$17,3,FALSE)))/(VLOOKUP(E399,'Siatka płac'!$B$6:$E$17,4,FALSE)-VLOOKUP(E399,'Siatka płac'!$B$6:$E$17,3,FALSE))),\"-\")","v":0.15},"I",{"$f":"IF(G399=\"poniżej min.\",((VLOOKUP(E399,'Siatka płac'!$B$6:$D$17,3,FALSE)-C399)*(13-'Zestawienie stanowisk'!$H$1)),\"-\")","v":"-"}]
[1,"Monter",2300,"Pracownik 396",{"$f":"IFERROR((VLOOKUP(B400,'Zestawienie stanowisk'!$B$5:$E$65,4,FALSE)),\"-\")","v":1},{"$f":"IFERROR(((C400-(VLOOKUP(E400,'Siatka płac'!$B$6:$E$17,3,FALSE)))/(VLOOKUP(E400,'Siatka płac'!$B$6:$E$17,4,FALSE)-VLOOKUP(E400,'Siatka płac'!$B$6:$E$17,3,FALSE))),\"-\")","v":0.15},"I",{"$f":"IF(G400=\"poniżej min.\",((VLOOKUP(E400,'Siatka płac'!$B$6:$D$17,3,FALSE)-C400)*(13-'Zestawienie stanowisk'!$H$1)),\"-\")","v":"-"}]
[1,"Monter",2300,"Pracownik 397",{"$f":"IFERROR((VLOOKUP(B401,'Zestawienie stanowisk'!$B$5:$E$65,4,FALSE)),\"-\")","v":1},{"$f":"IFERROR(((C401-(VLOOKUP(E401,'Siatka płac'!$B$6:$E$17,3,FALSE)))/(VLOOKUP(E401,'Siatka płac'!$B$6:$E$17,4,FALSE)-VLOOKUP(E401,'Siatka płac'!$B$6:$E$17,3,FALSE))),\"-\")","v":0.15},"I",{"$f":"IF(G401=\"poniżej min.\",((VLOOKUP(E401,'Siatka płac'!$B$6:$D$17,3,FALSE)-C401)*(13-'Zestawienie stanowisk'!$H$1)),\"-\")","v":"-"}]
[1,"Monter",2300,"Pracownik 398",{"$f":"IFERROR((VLOOKUP(B402,'Zestawienie stanowisk'!$B$5:$E$65,4,FALSE)),\"-\")","v":1},{"$f":"IFERROR(((C402-(VLOOKUP(E402,'Siatka płac'!$B$6:$E$17,3,FALSE)))/(VLOOKUP(E402,'Siatka płac'!$B$6:$E$17,4,FALSE)-VLOOKUP(E402,'Siatka płac'!$B$6:$E$17,3,FALSE))),\"-\")","v":0.15},"I",{"$f":"IF(G402=\"poniżej min.\",((VLOOKUP(E402,'Siatka płac'!$B$6:$D$17,3,FALSE)-C402)*(13-'Zestawienie stanowisk'!$H$1)),\"-\")","v":"-"}]
[1,"Monter",2300,"Pracownik 399",{"$f":"IFERROR((VLOOKUP(B403,'Zestawienie stanowisk'!$B$5:$E$65,4,FALSE)),\"-\")","v":1},{"$f":"IFERROR(((C403-(VLOOKUP(E403,'Siatka płac'!$B$6:$E$17,3,FALSE)))/(VLOOKUP(E403,'Siatka płac'!$B$6:$E$17,4,FALSE)-VLOOKUP(E403,'Siatka płac'!$B$6:$E$17,3,FALSE))),\"-\")","v":0.15},"I",{"$f":"IF(G403=\"poniżej min.\",((VLOOKUP(E403,'Siatka płac'!$B$6:$D$17,3,FALSE)-C403)*(13-'Zestawienie stanowisk'!$H$1)),\"-\")","v":"-"}]
[1,"Operator",2300,"Pracownik 400",{"$f":"IFERROR((VLOOKUP(B404,'Zestawienie stanowisk'!$B$5:$E$65,4,FALSE)),\"-\")","v":1},{"$f":"IFERROR(((C404-(VLOOKUP(E404,'Siatka płac'!$B$6:$E$17,3,FALSE)))/(VLOOKUP(E404,'Siatka płac'!$B$6:$E$17,4,FALSE)-VLOOKUP(E404,'Siatka płac'!$B$6:$E$17,3,FALSE))),\"-\")","v":0.15},"I",{"$f":"IF(G404=\"poniżej min.\",((VLOOKUP(E404,'Siatka płac'!$B$6:$D$17,3,FALSE)-C404)*(13-'Zestawienie stanowisk'!$H$1)),\"-\")","v":"-"}]
[1,"Operator",2300,"Pracownik 401",{"$f":"IFERROR((VLOOKUP(B405,'Zestawienie stanowisk'!$B$5:$E$65,4,FALSE)),\"-\")","v":1},{"$f":"IFERROR(((C405-(VLOOKUP(E405,'Siatka płac'!$B$6:$E$17,3,FALSE)))/(VLOOKUP(E405,'Siatka płac'!$B$6:$E$17,4,FALSE)-VLOOKUP(E405,'Siatka płac'!$B$6:$E$17,3,FALSE))),\"-\")","v":0.15},"I",{"$f":"IF(G405=\"poniżej min.\",((VLOOKUP(E405,'Siatka płac'!$B$6:$D$17,3,FALSE)-C405)*(13-'Zestawienie stanowisk'!$H$1)),\"-\")","v":"-"}]
[1,"Operator",2300,"Pracownik 402",{"$f":"IFERROR((VLOOKUP(B406,'Zestawienie stanowisk'!$B$5:$E$65,4,FALSE)),\"-\")","v":1},{"$f":"IFERROR(((C406-(VLOOKUP(E406,'Siatka płac'!$B$6:$E$17,3,FALSE)))/(VLOOKUP(E406,'Siatka płac'!$B$6:$E$17,4,FALSE)-VLOOKUP(E406,'Siatka płac'!$B$6:$E$17,3,FALSE))),\"-\")","v":0.15},"I",{"$f":"IF(G406=\"poniżej min.\",((VLOOKUP(E406,'Siatka płac'!$B$6:$D$17,3,FALSE)-C406)*(13-'Zestawienie stanowisk'!$H$1)),\"-\")","v":"-"}]
[1,"Operator",2300,"Pracownik 403",{"$f":"IFERROR((VLOOKUP(B407,'Zestawienie stanowisk'!$B$5:$E$65,4,FALSE)),\"-\")","v":1},{"$f":"IFERROR(((C407-(VLOOKUP(E407,'Siatka płac'!$B$6:$E$17,3,FALSE)))/(VLOOKUP(E407,'Siatka płac'!$B$6:$E$17,4,FALSE)-VLOOKUP(E407,'Siatka płac'!$B$6:$E$17,3,FALSE))),\"-\")","v":0.15},"I",{"$f":"IF(G407=\"poniżej min.\",((VLOOKUP(E407,'Siatka płac'!$B$6:$D$17,3,FALSE)-C407)*(13-'Zestawienie stanowisk'!$H$1)),\"-\")","v":"-"}]
[1,"Operator",2300,"Pracownik 404",{"$f":"IFERROR((VLOOKUP(B408,'Zestawienie stanowisk'!$B$5:$E$65,4,FALSE)),\"-\")","v":1},{"$f":"IFERROR(((C408-(VLOOKUP(E408,'Siatka płac'!$B$6:$E$17,3,FALSE)))/(VLOOKUP(E408,'Siatka płac'!$B$6:$E$17,4,FALSE)-VLOOKUP(E408,'Siatka płac'!$B$6:$E$17,3,FALSE))),\"-\")","v":0.15},"I",{"$f":"IF(G408=\"poniżej min.\",((VLOOKUP(E408,'Siatka płac'!$B$6:$D$17,3,FALSE)-C408)*(13-'Zestawienie stanowisk'!$H$1)),\"-\")","v":"-"}]
[1,"Operator",2500,"Pracownik 405",{"$f":"IFERROR((VLOOKUP(B409,'Zestawienie stanowisk'!$B$5:$E$65,4,FALSE)),\"-\")","v":1},{"$f":"IFERROR(((C409-(VLOOKUP(E409,'Siatka płac'!$B$6:$E$17,3,FALSE)))/(VLOOKUP(E409,'Siatka płac'!$B$6:$E$17,4,FALSE)-VLOOKUP(E409,'Siatka płac'!$B$6:$E$17,3,FALSE))),\"-\")","v":0.25},"I",{"$f":"IF(G409=\"poniżej min.\",((VLOOKUP(E409,'Siatka płac'!$B$6:$D$17,3,FALSE)-C409)*(13-'Zestawienie stanowisk'!$H$1)),\"-\")","v":"-"}]
[1,"Operator",2500,"Pracownik 406",{"$f":"IFERROR((VLOOKUP(B410,'Zestawienie stanowisk'!$B$5:$E$65,4,FALSE)),\"-\")","v":1},{"$f":"IFERROR(((C410-(VLOOKUP(E410,'Siatka płac'!$B$6:$E$17,3,FALSE)))/(VLOOKUP(E410,'Siatka płac'!$B$6:$E$17,4,FALSE)-VLOOKUP(E410,'Siatka płac'!$B$6:$E$17,3,FALSE))),\"-\")","v":0.25},"I",{"$f":"IF(G410=\"poniżej min.\",((VLOOKUP(E410,'Siatka płac'!$B$6:$D$17,3,FALSE)-C410)*(13-'Zestawienie stanowisk'!$H$1)),\"-\")","v":"-"}]
[1,"Operator",2500,"Pracownik 407",{"$f":"IFERROR((VLOOKUP(B411,'Zestawienie stanowisk'!$B$5:$E$65,4,FALSE)),\"-\")","v":1},{"$f":"IFERROR(((C411-(VLOOKUP(E411,'Siatka płac'!$B$6:$E$17,3,FALSE)))/(VLOOKUP(E411,'Siatka płac'!$B$6:$E$17,4,FALSE)-VLOOKUP(E411,'Siatka płac'!$B$6:$E$17,3,FALSE))),\"-\")","v":0.25},"I",{"$f":"IF(G411=\"poniżej min.\",((VLOOKUP(E411,'Siatka płac'!$B$6:$D$17,3,FALSE)-C411)*(13-'Zestawienie stanowisk'!$H$1)),\"-\")","v":"-"}]
[1,"Operator",2500,"Pracownik 408",{"$f":"IFERROR((VLOOKUP(B412,'Zestawienie stanowisk'!$B$5:$E$65,4,FALSE)),\"-\")","v":1},{"$f":"IFERROR(((C412-(VLOOKUP(E412,'Siatka płac'!$B$6:$E$17,3,FALSE)))/(VLOOKUP(E412,'Siatka płac'!$B$6:$E$17,4,FALSE)-VLOOKUP(E412,'Siatka płac'!$B$6:$E$17,3,FALSE))),\"-\")","v":0.25},"I",{"$f":"IF(G412=\"poniżej min.\",((VLOOKUP(E412,'Siatka płac'!$B$6:$D$17,3,FALSE)-C412)*(13-'Zestawienie stanowisk'!$H$1)),\"-\")","v":"-"}]
[1,"Operator",2500,"Pracownik 409",{"$f":"IFERROR((VLOOKUP(B413,'Zestawienie stanowisk'!$B$5:$E$65,4,FALSE)),\"-\")","v":1},{"$f":"IFERROR(((C413-(VLOOKUP(E413,'Siatka płac'!$B$6:$E$17,3,FALSE)))/(VLOOKUP(E413,'Siatka płac'!$B$6:$E$17,4,FALSE)-VLOOKUP(E413,'Siatka płac'!$B$6:$E$17,3,FALSE))),\"-\")","v":0.25},"I",{"$f":"IF(G413=\"poniżej min.\",((VLOOKUP(E413,'Siatka płac'!$B$6:$D$17,3,FALSE)-C413)*(13-'Zestawienie stanowisk'!$H$1)),\"-\")","v":"-"}]
[1,"Operator",2800,"Pracownik 410",{"$f":"IFERROR((VLOOKUP(B414,'Zestawienie stanowisk'!$B$5:$E$65,4,FALSE)),\"-\")","v":1},{"$f":"IFERROR(((C414-(VLOOKUP(E414,'Siatka płac'!$B$6:$E$17,3,FALSE)))/(VLOOKUP(E414,'Siatka płac'!$B$6:$E$17,4,FALSE)-VLOOKUP(E414,'Siatka płac'!$B$6:$E$17,3,FALSE))),\"-\")","v":0.4},"II",{"$f":"IF(G414=\"poniżej min.\",((VLOOKUP(E414,'Siatka płac'!$B$6:$D$17,3,FALSE)-C414)*(13-'Zestawienie stanowisk'!$H$1)),\"-\")","v":"-"}]
[1,"Operator",2800,"Pracownik 411",{"$f":"IFERROR((VLOOKUP(B415,'Zestawienie stanowisk'!$B$5:$E$65,4,FALSE)),\"-\")","v":1},{"$f":"IFERROR(((C415-(VLOOKUP(E415,'Siatka płac'!$B$6:$E$17,3,FALSE)))/(VLOOKUP(E415,'Siatka płac'!$B$6:$E$17,4,FALSE)-VLOOKUP(E415,'Siatka płac'!$B$6:$E$17,3,FALSE))),\"-\")","v":0.4},"II",{"$f":"IF(G415=\"poniżej min.\",((VLOOKUP(E415,'Siatka płac'!$B$6:$D$17,3,FALSE)-C415)*(13-'Zestawienie stanowisk'!$H$1)),\"-\")","v":"-"}]
[1,"Operator",2800,"Pracownik 412",{"$f":"IFERROR((VLOOKUP(B416,'Zestawienie stanowisk'!$B$5:$E$65,4,FALSE)),\"-\")","v":1},{"$f":"IFERROR(((C416-(VLOOKUP(E416,'Siatka płac'!$B$6:$E$17,3,FALSE)))/(VLOOKUP(E416,'Siatka płac'!$B$6:$E$17,4,FALSE)-VLOOKUP(E416,'Siatka płac'!$B$6:$E$17,3,FALSE))),\"-\")","v":0.4},"II",{"$f":"IF(G416=\"poniżej min.\",((VLOOKUP(E416,'Siatka płac'!$B$6:$D$17,3,FALSE)-C416)*(13-'Zestawienie stanowisk'!$H$1)),\"-\")","v":"-"}]
[1,"Operator",2800,"Pracownik 413",{"$f":"IFERROR((VLOOKUP(B417,'Zestawienie stanowisk'!$B$5:$E$65,4,FALSE)),\"-\")","v":1},{"$f":"IFERROR(((C417-(VLOOKUP(E417,'Siatka płac'!$B$6:$E$17,3,FALSE)))/(VLOOKUP(E417,'Siatka płac'!$B$6:$E$17,4,FALSE)-VLOOKUP(E417,'Siatka płac'!$B$6:$E$17,3,FALSE))),\"-\")","v":0.4},"II",{"$f":"IF(G417=\"poniżej min.\",((VLOOKUP(E417,'Siatka płac'!$B$6:$D$17,3,FALSE)-C417)*(13-'Zestawienie stanowisk'!$H$1)),\"-\")","v":"-"}]
[1,"Operator",3500,"Pracownik 414",{"$f":"IFERROR((VLOOKUP(B418,'Zestawienie stanowisk'!$B$5:$E$65,4,FALSE)),\"-\")","v":1},{"$f":"IFERROR(((C418-(VLOOKUP(E418,'Siatka płac'!$B$6:$E$17,3,FALSE)))/(VLOOKUP(E418,'Siatka płac'!$B$6:$E$17,4,FALSE)-VLOOKUP(E418,'Siatka płac'!$B$6:$E$17,3,FALSE))),\"-\")","v":0.75},"III",{"$f":"IF(G418=\"poniżej min.\",((VLOOKUP(E418,'Siatka płac'!$B$6:$D$17,3,FALSE)-C418)*(13-'Zestawienie stanowisk'!$H$1)),\"-\")","v":"-"}]
[1,"Operator",3500,"Pracownik 415",{"$f":"IFERROR((VLOOKUP(B419,'Zestawienie stanowisk'!$B$5:$E$65,4,FALSE)),\"-\")","v":1},{"$f":"IFERROR(((C419-(VLOOKUP(E419,'Siatka płac'!$B$6:$E$17,3,FALSE)))/(VLOOKUP(E419,'Siatka płac'!$B$6:$E$17,4,FALSE)-VLOOKUP(E419,'Siatka płac'!$B$6:$E$17,3,FALSE))),\"-\")","v":0.75},"III",{"$f":"IF(G419=\"poniżej min.\",((VLOOKUP(E419,'Siatka płac'!$B$6:$D$17,3,FALSE)-C419)*(13-'Zestawienie stanowisk'!$H$1)),\"-\")","v":"-"}]
[1,"Operator",3500,"Pracownik 416",{"$f":"IFERROR((VLOOKUP(B420,'Zestawienie stanowisk'!$B$5:$E$65,4,FALSE)),\"-\")","v":1},{"$f":"IFERROR(((C420-(VLOOKUP(E420,'Siatka płac'!$B$6:$E$17,3,FALSE)))/(VLOOKUP(E420,'Siatka płac'!$B$6:$E$17,4,FALSE)-VLOOKUP(E420,'Siatka płac'!$B$6:$E$17,3,FALSE))),\"-\")","v":0.75},"III",{"$f":"IF(G420=\"poniżej min.\",((VLOOKUP(E420,'Siatka płac'!$B$6:$D$17,3,FALSE)-C420)*(13-'Zestawienie stanowisk'!$H$1)),\"-\")","v":"-"}]
[1,"Operator",3500,"Pracownik 417",{"$f":"IFERROR((VLOOKUP(B421,'Zestawienie stanowisk'!$B$5:$E$65,4,FALSE)),\"-\")","v":1},{"$f":"IFERROR(((C421-(VLOOKUP(E421,'Siatka płac'!$B$6:$E$17,3,FALSE)))/(VLOOKUP(E421,'Siatka płac'!$B$6:$E$17,4,FALSE)-VLOOKUP(E421,'Siatka płac'!$B$6:$E$17,3,FALSE))),\"-\")","v":0.75},"III",{"$f":"IF(G421=\"poniżej min.\",((VLOOKUP(E421,'Siatka płac'!$B$6:$D$17,3,FALSE)-C421)*(13-'Zestawienie stanowisk'!$H$1)),\"-\")","v":"-"}]
[1,"Operator",3500,"Pracownik 418",{"$f":"IFERROR((VLOOKUP(B422,'Zestawienie stanowisk'!$B$5:$E$65,4,FALSE)),\"-\")","v":1},{"$f":"IFERROR(((C422-(VLOOKUP(E422,'Siatka płac'!$B$6:$E$17,3,FALSE)))/(VLOOKUP(E422,'Siatka płac'!$B$6:$E$17,4,FALSE)-VLOOKUP(E422,'Siatka płac'!$B$6:$E$17,3,FALSE))),\"-\")","v":0.75},"III",{"$f":"IF(G422=\"poniżej min.\",((VLOOKUP(E422,'Siatka płac'!$B$6:$D$17,3,FALSE)-C422)*(13-'Zestawienie stanowisk'!$H$1)),\"-\")","v":"-"}]
[1,"Operator",3500,"Pracownik 419",{"$f":"IFERROR((VLOOKUP(B423,'Zestawienie stanowisk'!$B$5:$E$65,4,FALSE)),\"-\")","v":1},{"$f":"IFERROR(((C423-(VLOOKUP(E423,'Siatka płac'!$B$6:$E$17,3,FALSE)))/(VLOOKUP(E423,'Siatka płac'!$B$6:$E$17,4,FALSE)-VLOOKUP(E423,'Siatka płac'!$B$6:$E$17,3,FALSE))),\"-\")","v":0.75},"III",{"$f":"IF(G423=\"poniżej min.\",((VLOOKUP(E423,'Siatka płac'!$B$6:$D$17,3,FALSE)-C423)*(13-'Zestawienie stanowisk'!$H$1)),\"-\")","v":"-"}]
[1,"Operator",3800,"Pracownik 420",{"$f":"IFERROR((VLOOKUP(B424,'Zestawienie stanowisk'!$B$5:$E$65,4,FALSE)),\"-\")","v":1},{"$f":"IFERROR(((C424-(VLOOKUP(E424,'Siatka płac'!$B$6:$E$17,3,FALSE)))/(VLOOKUP(E424,'Siatka płac'!$B$6:$E$17,4,FALSE)-VLOOKUP(E424,'Siatka płac'!$B$6:$E$17,3,FALSE))),\"-\")","v":0.9},"IV",{"$f":"IF(G424=\"poniżej min.\",((VLOOKUP(E424,'Siatka płac'!$B$6:$D$17,3,FALSE)-C424)*(13-'Zestawienie stanowisk'!$H$1)),\"-\")","v":"-"}]
[1,"Monter",2300,"Pracownik 421",{"$f":"IFERROR((VLOOKUP(B425,'Zestawienie stanowisk'!$B$5:$E$65,4,FALSE)),\"-\")","v":1},{"$f":"IFERROR(((C425-(VLOOKUP(E425,'Siatka płac'!$B$6:$E$17,3,FALSE)))/(VLOOKUP(E425,'Siatka płac'!$B$6:$E$17,4,FALSE)-VLOOKUP(E425,'Siatka płac'!$B$6:$E$17,3,FALSE))),\"-\")","v":0.15},"I",{"$f":"IF(G425=\"poniżej min.\",((VLOOKUP(E425,'Siatka płac'!$B$6:$D$17,3,FALSE)-C425)*(13-'Zestawienie stanowisk'!$H$1)),\"-\")","v":"-"}]
[1,"Monter",2300,"Pracownik 422",{"$f":"IFERROR((VLOOKUP(B426,'Zestawienie stanowisk'!$B$5:$E$65,4,FALSE)),\"-\")","v":1},{"$f":"IFERROR(((C426-(VLOOKUP(E426,'Siatka płac'!$B$6:$E$17,3,FALSE)))/(VLOOKUP(E426,'Siatka płac'!$B$6:$E$17,4,FALSE)-VLOOKUP(E426,'Siatka płac'!$B$6:$E$17,3,FALSE))),\"-\")","v":0.15},"I",{"$f":"IF(G426=\"poniżej min.\",((VLOOKUP(E426,'Siatka płac'!$B$6:$D$17,3,FALSE)-C426)*(13-'Zestawienie stanowisk'!$H$1)),\"-\")","v":"-"}]
[1,"Monter",2300,"Pracownik 423",{"$f":"IFERROR((VLOOKUP(B427,'Zestawienie stanowisk'!$B$5:$E$65,4,FALSE)),\"-\")","v":1},{"$f":"IFERROR(((C427-(VLOOKUP(E427,'Siatka płac'!$B$6:$E$17,3,FALSE)))/(VLOOKUP(E427,'Siatka płac'!$B$6:$E$17,4,FALSE)-VLOOKUP(E427,'Siatka płac'!$B$6:$E$17,3,FALSE))),\"-\")","v":0.15},"I",{"$f":"IF(G427=\"poniżej min.\",((VLOOKUP(E427,'Siatka płac'!$B$6:$D$17,3,FALSE)-C427)*(13-'Zestawienie stanowisk'!$H$1)),\"-\")","v":"-"}]
[1,"Monter",2300,"Pracownik 424",{"$f":"IFERROR((VLOOKUP(B428,'Zestawienie stanowisk'!$B$5:$E$65,4,FALSE)),\"-\")","v":1},{"$f":"IFERROR(((C428-(VLOOKUP(E428,'Siatka płac'!$B$6:$E$17,3,FALSE)))/(VLOOKUP(E428,'Siatka płac'!$B$6:$E$17,4,FALSE)-VLOOKUP(E428,'Siatka płac'!$B$6:$E$17,3,FALSE))),\"-\")","v":0.15},"I",{"$f":"IF(G428=\"poniżej min.\",((VLOOKUP(E428,'Siatka płac'!$B$6:$D$17,3,FALSE)-C428)*(13-'Zestawienie stanowisk'!$H$1)),\"-\")","v":"-"}]
[1,"Monter",2300,"Pracownik 425",{"$f":"IFERROR((VLOOKUP(B429,'Zestawienie stanowisk'!$B$5:$E$65,4,FALSE)),\"-\")","v":1},{"$f":"IFERROR(((C429-(VLOOKUP(E429,'Siatka płac'!$B$6:$E$17,3,FALSE)))/(VLOOKUP(E429,'Siatka płac'!$B$6:$E$17,4,FALSE)-VLOOKUP(E429,'Siatka płac'!$B$6:$E$17,3,FALSE))),\"-\")","v":0.15},"I",{"$f":"IF(G429=\"poniżej min.\",((VLOOKUP(E429,'Siatka płac'!$B$6:$D$17,3,FALSE)-C429)*(13-'Zestawienie stanowisk'!$H$1)),\"-\")","v":"-"}]
[1,"Monter",2300,"Pracownik 426",{"$f":"IFERROR((VLOOKUP(B430,'Zestawienie stanowisk'!$B$5:$E$65,4,FALSE)),\"-\")","v":1},{"$f":"IFERROR(((C430-(VLOOKUP(E430,'Siatka płac'!$B$6:$E$17,3,FALSE)))/(VLOOKUP(E430,'Siatka płac'!$B$6:$E$17,4,FALSE)-VLOOKUP(E430,'Siatka płac'!$B$6:$E$17,3,FALSE))),\"-\")","v":0.15},"I",{"$f":"IF(G430=\"poniżej min.\",((VLOOKUP(E430,'Siatka płac'!$B$6:$D$17,3,FALSE)-C430)*(13-'Zestawienie stanowisk'!$H$1)),\"-\")","v":"-"}]
[0,null,null,null,{"$f":"IFERROR((VLOOKUP(B431,'Zestawienie stanowisk'!$B$5:$E$65,4,FALSE)),\"-\")","v":"-"},{"$f":"IFERROR(((C431-(VLOOKUP(E431,'Siatka płac'!$B$6:$E$17,3,FALSE)))/(VLOOKUP(E431,'Siatka płac'!$B$6:$E$17,4,FALSE)-VLOOKUP(E431,'Siatka płac'!$B$6:$E$17,3,FALSE))),\"-\")","v":"-"},"-",{"$f":"IF(G431=\"poniżej min.\",((VLOOKUP(E431,'Siatka płac'!$B$6:$D$17,3,FALSE)-C431)*(13-'Zestawienie stanowisk'!$H$1)),\"-\")","v":"-"}]
[0,null,null,null,{"$f":"IFERROR((VLOOKUP(B432,'Zestawienie stanowisk'!$B$5:$E$65,4,FALSE)),\"-\")","v":"-"},{"$f":"IFERROR(((C432-(VLOOKUP(E432,'Siatka płac'!$B$6:$E$17,3,FALSE)))/(VLOOKUP(E432,'Siatka płac'!$B$6:$E$17,4,FALSE)-VLOOKUP(E432,'Siatka płac'!$B$6:$E$17,3,FALSE))),\"-\")","v":"-"},"-",{"$f":"IF(G432=\"poniżej min.\",((VLOOKUP(E432,'Siatka płac'!$B$6:$D$17,3,FALSE)-C432)*(13-'Zestawienie stanowisk'!$H$1)),\"-\")","v":"-"}]
[0,null,null,null,{"$f":"IFERROR((VLOOKUP(B433,'Zestawienie stanowisk'!$B$5:$E$65,4,FALSE)),\"-\")","v":"-"},{"$f":"IFERROR(((C433-(VLOOKUP(E433,'Siatka płac'!$B$6:$E$17,3,FALSE)))/(VLOOKUP(E433,'Siatka płac'!$B$6:$E$17,4,FALSE)-VLOOKUP(E433,'Siatka płac'!$B$6:$E$17,3,FALSE))),\"-\")","v":"-"},"-",{"$f":"IF(G433=\"poniżej min.\",((VLOOKUP(E433,'Siatka płac'!$B$6:$D$17,3,FALSE)-C433)*(13-'Zestawienie stanowisk'!$H$1)),\"-\")","v":"-"}]
[0,null,null,null,{"$f":"IFERROR((VLOOKUP(B434,'Zestawienie stanowisk'!$B$5:$E$65,4,FALSE)),\"-\")","v":"-"},{"$f":"IFERROR(((C434-(VLOOKUP(E434,'Siatka płac'!$B$6:$E$17,3,FALSE)))/(VLOOKUP(E434,'Siatka płac'!$B$6:$E$17,4,FALSE)-VLOOKUP(E434,'Siatka płac'!$B$6:$E$17,3,FALSE))),\"-\")","v":"-"},"-",{"$f":"IF(G434=\"poniżej min.\",((VLOOKUP(E434,'Siatka płac'!$B$6:$D$17,3,FALSE)-C434)*(13-'Zestawienie stanowisk'!$H$1)),\"-\")","v":"-"}]
[0,null,null,null,{"$f":"IFERROR((VLOOKUP(B435,'Zestawienie stanowisk'!$B$5:$E$65,4,FALSE)),\"-\")","v":"-"},{"$f":"IFERROR(((C435-(VLOOKUP(E435,'Siatka płac'!$B$6:$E$17,3,FALSE)))/(VLOOKUP(E435,'Siatka płac'!$B$6:$E$17,4,FALSE)-VLOOKUP(E435,'Siatka płac'!$B$6:$E$17,3,FALSE))),\"-\")","v":"-"},"-",{"$f":"IF(G435=\"poniżej min.\",((VLOOKUP(E435,'Siatka płac'!$B$6:$D$17,3,FALSE)-C435)*(13-'Zestawienie stanowisk'!$H$1)),\"-\")","v":"-"}]
[0,null,null,null,{"$f":"IFERROR((VLOOKUP(B436,'Zestawienie stanowisk'!$B$5:$E$65,4,FALSE)),\"-\")","v":"-"},{"$f":"IFERROR(((C436-(VLOOKUP(E436,'Siatka płac'!$B$6:$E$17,3,FALSE)))/(VLOOKUP(E436,'Siatka płac'!$B$6:$E$17,4,FALSE)-VLOOKUP(E436,'Siatka płac'!$B$6:$E$17,3,FALSE))),\"-\")","v":"-"},"-",{"$f":"IF(G436=\"poniżej min.\",((VLOOKUP(E436,'Siatka płac'!$B$6:$D$17,3,FALSE)-C436)*(13-'Zestawienie stanowisk'!$H$1)),\"-\")","v":"-"}]
[0,null,null,null,{"$f":"IFERROR((VLOOKUP(B437,'Zestawienie stanowisk'!$B$5:$E$65,4,FALSE)),\"-\")","v":"-"},{"$f":"IFERROR(((C437-(VLOOKUP(E437,'Siatka płac'!$B$6:$E$17,3,FALSE)))/(VLOOKUP(E437,'Siatka płac'!$B$6:$E$17,4,FALSE)-VLOOKUP(E437,'Siatka płac'!$B$6:$E$17,3,FALSE))),\"-\")","v":"-"},"-",{"$f":"IF(G437=\"poniżej min.\",((VLOOKUP(E437,'Siatka płac'!$B$6:$D$17,3,FALSE)-C437)*(13-'Zestawienie stanowisk'!$H$1)),\"-\")","v":"-"}]
[0,null,null,null,{"$f":"IFERROR((VLOOKUP(B438,'Zestawienie stanowisk'!$B$5:$E$65,4,FALSE)),\"-\")","v":"-"},{"$f":"IFERROR(((C438-(VLOOKUP(E438,'Siatka płac'!$B$6:$E$17,3,FALSE)))/(VLOOKUP(E438,'Siatka płac'!$B$6:$E$17,4,FALSE)-VLOOKUP(E438,'Siatka płac'!$B$6:$E$17,3,FALSE))),\"-\")","v":"-"},"-",{"$f":"IF(G438=\"poniżej min.\",((VLOOKUP(E438,'Siatka płac'!$B$6:$D$17,3,FALSE)-C438)*(13-'Zestawienie stanowisk'!$H$1)),\"-\")","v":"-"}]
[0,null,null,null,{"$f":"IFERROR((VLOOKUP(B439,'Zestawienie stanowisk'!$B$5:$E$65,4,FALSE)),\"-\")","v":"-"},{"$f":"IFERROR(((C439-(VLOOKUP(E439,'Siatka płac'!$B$6:$E$17,3,FALSE)))/(VLOOKUP(E439,'Siatka płac'!$B$6:$E$17,4,FALSE)-VLOOKUP(E439,'Siatka płac'!$B$6:$E$17,3,FALSE))),\"-\")","v":"-"},"-",{"$f":"IF(G439=\"poniżej min.\",((VLOOKUP(E439,'Siatka płac'!$B$6:$D$17,3,FALSE)-C439)*(13-'Zestawienie stanowisk'!$H$1)),\"-\")","v":"-"}]
[0,null,null,null,{"$f":"IFERROR((VLOOKUP(B440,'Zestawienie stanowisk'!$B$5:$E$65,4,FALSE)),\"-\")","v":"-"},{"$f":"IFERROR(((C440-(VLOOKUP(E440,'Siatka płac'!$B$6:$E$17,3,FALSE)))/(VLOOKUP(E440,'Siatka płac'!$B$6:$E$17,4,FALSE)-VLOOKUP(E440,'Siatka płac'!$B$6:$E$17,3,FALSE))),\"-\")","v":"-"},"-",{"$f":"IF(G440=\"poniżej min.\",((VLOOKUP(E440,'Siatka płac'!$B$6:$D$17,3,FALSE)-C440)*(13-'Zestawienie stanowisk'!$H$1)),\"-\")","v":"-"}]
[0,null,null,null,{"$f":"IFERROR((VLOOKUP(B441,'Zestawienie stanowisk'!$B$5:$E$65,4,FALSE)),\"-\")","v":"-"},{"$f":"IFERROR(((C441-(VLOOKUP(E441,'Siatka płac'!$B$6:$E$17,3,FALSE)))/(VLOOKUP(E441,'Siatka płac'!$B$6:$E$17,4,FALSE)-VLOOKUP(E441,'Siatka płac'!$B$6:$E$17,3,FALSE))),\"-\")","v":"-"},"-",{"$f":"IF(G441=\"poniżej min.\",((VLOOKUP(E441,'Siatka płac'!$B$6:$D$17,3,FALSE)-C441)*(13-'Zestawienie stanowisk'!$H$1)),\"-\")","v":"-"}]
[0,null,null,null,{"$f":"IFERROR((VLOOKUP(B442,'Zestawienie stanowisk'!$B$5:$E$65,4,FALSE)),\"-\")","v":"-"},{"$f":"IFERROR(((C442-(VLOOKUP(E442,'Siatka płac'!$B$6:$E$17,3,FALSE)))/(VLOOKUP(E442,'Siatka płac'!$B$6:$E$17,4,FALSE)-VLOOKUP(E442,'Siatka płac'!$B$6:$E$17,3,FALSE))),\"-\")","v":"-"},"-",{"$f":"IF(G442=\"poniżej min.\",((VLOOKUP(E442,'Siatka płac'!$B$6:$D$17,3,FALSE)-C442)*(13-'Zestawienie stanowisk'!$H$1)),\"-\")","v":"-"}]
[0,null,null,null,{"$f":"IFERROR((VLOOKUP(B443,'Zestawienie stanowisk'!$B$5:$E$65,4,FALSE)),\"-\")","v":"-"},{"$f":"IFERROR(((C443-(VLOOKUP(E443,'Siatka płac'!$B$6:$E$17,3,FALSE)))/(VLOOKUP(E443,'Siatka płac'!$B$6:$E$17,4,FALSE)-VLOOKUP(E443,'Siatka płac'!$B$6:$E$17,3,FALSE))),\"-\")","v":"-"},"-",{"$f":"IF(G443=\"poniżej min.\",((VLOOKUP(E443,'Siatka płac'!$B$6:$D$17,3,FALSE)-C443)*(13-'Zestawienie stanowisk'!$H$1)),\"-\")","v":"-"}]
[0,null,null,null,{"$f":"IFERROR((VLOOKUP(B444,'Zestawienie stanowisk'!$B$5:$E$65,4,FALSE)),\"-\")","v":"-"},{"$f":"IFERROR(((C444-(VLOOKUP(E444,'Siatka płac'!$B$6:$E$17,3,FALSE)))/(VLOOKUP(E444,'Siatka płac'!$B$6:$E$17,4,FALSE)-VLOOKUP(E444,'Siatka płac'!$B$6:$E$17,3,FALSE))),\"-\")","v":"-"},"-",{"$f":"IF(G444=\"poniżej min.\",((VLOOKUP(E444,'Siatka płac'!$B$6:$D$17,3,FALSE)-C444)*(13-'Zestawienie stanowisk'!$H$1)),\"-\")","v":"-"}]
[0,null,null,null,{"$f":"IFERROR((VLOOKUP(B445,'Zestawienie stanowisk'!$B$5:$E$65,4,FALSE)),\"-\")","v":"-"},{"$f":"IFERROR(((C445-(VLOOKUP(E445,'Siatka płac'!$B$6:$E$17,3,FALSE)))/(VLOOKUP(E445,'Siatka płac'!$B$6:$E$17,4,FALSE)-VLOOKUP(E445,'Siatka płac'!$B$6:$E$17,3,FALSE))),\"-\")","v":"-"},"-",{"$f":"IF(G445=\"poniżej min.\",((VLOOKUP(E445,'Siatka płac'!$B$6:$D$17,3,FALSE)-C445)*(13-'Zestawienie stanowisk'!$H$1)),\"-\")","v":"-"}]
[0,null,null,null,{"$f":"IFERROR((VLOOKUP(B446,'Zestawienie stanowisk'!$B$5:$E$65,4,FALSE)),\"-\")","v":"-"},{"$f":"IFERROR(((C446-(VLOOKUP(E446,'Siatka płac'!$B$6:$E$17,3,FALSE)))/(VLOOKUP(E446,'Siatka płac'!$B$6:$E$17,4,FALSE)-VLOOKUP(E446,'Siatka płac'!$B$6:$E$17,3,FALSE))),\"-\")","v":"-"},"-",{"$f":"IF(G446=\"poniżej min.\",((VLOOKUP(E446,'Siatka płac'!$B$6:$D$17,3,FALSE)-C446)*(13-'Zestawienie stanowisk'!$H$1)),\"-\")","v":"-"}]
[0,null,null,null,{"$f":"IFERROR((VLOOKUP(B447,'Zestawienie stanowisk'!$B$5:$E$65,4,FALSE)),\"-\")","v":"-"},{"$f":"IFERROR(((C447-(VLOOKUP(E447,'Siatka płac'!$B$6:$E$17,3,FALSE)))/(VLOOKUP(E447,'Siatka płac'!$B$6:$E$17,4,FALSE)-VLOOKUP(E447,'Siatka płac'!$B$6:$E$17,3,FALSE))),\"-\")","v":"-"},"-",{"$f":"IF(G447=\"poniżej min.\",((VLOOKUP(E447,'Siatka płac'!$B$6:$D$17,3,FALSE)-C447)*(13-'Zestawienie stanowisk'!$H$1)),\"-\")","v":"-"}]
[0,null,null,null,{"$f":"IFERROR((VLOOKUP(B448,'Zestawienie stanowisk'!$B$5:$E$65,4,FALSE)),\"-\")","v":"-"},{"$f":"IFERROR(((C448-(VLOOKUP(E448,'Siatka płac'!$B$6:$E$17,3,FALSE)))/(VLOOKUP(E448,'Siatka płac'!$B$6:$E$17,4,FALSE)-VLOOKUP(E448,'Siatka płac'!$B$6:$E$17,3,FALSE))),\"-\")","v":"-"},"-",{"$f":"IF(G448=\"poniżej min.\",((VLOOKUP(E448,'Siatka płac'!$B$6:$D$17,3,FALSE)-C448)*(13-'Zestawienie stanowisk'!$H$1)),\"-\")","v":"-"}]
[0,null,null,null,{"$f":"IFERROR((VLOOKUP(B449,'Zestawienie stanowisk'!$B$5:$E$65,4,FALSE)),\"-\")","v":"-"},{"$f":"IFERROR(((C449-(VLOOKUP(E449,'Siatka płac'!$B$6:$E$17,3,FALSE)))/(VLOOKUP(E449,'Siatka płac'!$B$6:$E$17,4,FALSE)-VLOOKUP(E449,'Siatka płac'!$B$6:$E$17,3,FALSE))),\"-\")","v":"-"},"-",{"$f":"IF(G449=\"poniżej min.\",((VLOOKUP(E449,'Siatka płac'!$B$6:$D$17,3,FALSE)-C449)*(13-'Zestawienie stanowisk'!$H$1)),\"-\")","v":"-"}]
[0,null,null,null,{"$f":"IFERROR((VLOOKUP(B450,'Zestawienie stanowisk'!$B$5:$E$65,4,FALSE)),\"-\")","v":"-"},{"$f":"IFERROR(((C450-(VLOOKUP(E450,'Siatka płac'!$B$6:$E$17,3,FALSE)))/(VLOOKUP(E450,'Siatka płac'!$B$6:$E$17,4,FALSE)-VLOOKUP(E450,'Siatka płac'!$B$6:$E$17,3,FALSE))),\"-\")","v":"-"},"-",{"$f":"IF(G450=\"poniżej min.\",((VLOOKUP(E450,'Siatka płac'!$B$6:$D$17,3,FALSE)-C450)*(13-'Zestawienie stanowisk'!$H$1)),\"-\")","v":"-"}]
[0,null,null,null,{"$f":"IFERROR((VLOOKUP(B451,'Zestawienie stanowisk'!$B$5:$E$65,4,FALSE)),\"-\")","v":"-"},{"$f":"IFERROR(((C451-(VLOOKUP(E451,'Siatka płac'!$B$6:$E$17,3,FALSE)))/(VLOOKUP(E451,'Siatka płac'!$B$6:$E$17,4,FALSE)-VLOOKUP(E451,'Siatka płac'!$B$6:$E$17,3,FALSE))),\"-\")","v":"-"},"-",{"$f":"IF(G451=\"poniżej min.\",((VLOOKUP(E451,'Siatka płac'!$B$6:$D$17,3,FALSE)-C451)*(13-'Zestawienie stanowisk'!$H$1)),\"-\")","v":"-"}]
[0,null,null,null,{"$f":"IFERROR((VLOOKUP(B452,'Zestawienie stanowisk'!$B$5:$E$65,4,FALSE)),\"-\")","v":"-"},{"$f":"IFERROR(((C452-(VLOOKUP(E452,'Siatka płac'!$B$6:$E$17,3,FALSE)))/(VLOOKUP(E452,'Siatka płac'!$B$6:$E$17,4,FALSE)-VLOOKUP(E452,'Siatka płac'!$B$6:$E$17,3,FALSE))),\"-\")","v":"-"},"-",{"$f":"IF(G452=\"poniżej min.\",((VLOOKUP(E452,'Siatka płac'!$B$6:$D$17,3,FALSE)-C452)*(13-'Zestawienie stanowisk'!$H$1)),\"-\")","v":"-"}]
[{"$f":"IF(ISBLANK(B453),0,1)","v":0},null,null,null,{"$f":"IFERROR((VLOOKUP(B453,'Zestawienie stanowisk'!$B$5:$E$65,4,FALSE)),\"-\")","v":"-"},{"$f":"IFERROR(((C453-(VLOOKUP(E453,'Siatka płac'!$B$6:$E$17,3,FALSE)))/(VLOOKUP(E453,'Siatka płac'!$B$6:$E$17,4,FALSE)-VLOOKUP(E453,'Siatka płac'!$B$6:$E$17,3,FALSE))),\"-\")","v":"-"},{"$f":"IFERROR((INDEX($N$5:$N$10,MATCH(F453,$M$5:$M$10,-1))),\"-\")","v":"-"},{"$f":"IF(G453=\"poniżej min.\",((VLOOKUP(E453,'Siatka płac'!$B$6:$D$17,3,FALSE)-C453)*(13-'Zestawienie stanowisk'!$H$1)),\"-\")","v":"-"}]
[0,null,null,null,{"$f":"IFERROR((VLOOKUP(B454,'Zestawienie stanowisk'!$B$5:$E$65,4,FALSE)),\"-\")","v":"-"},{"$f":"IFERROR(((C454-(VLOOKUP(E454,'Siatka płac'!$B$6:$E$17,3,FALSE)))/(VLOOKUP(E454,'Siatka płac'!$B$6:$E$17,4,FALSE)-VLOOKUP(E454,'Siatka płac'!$B$6:$E$17,3,FALSE))),\"-\")","v":"-"},"-",{"$f":"IF(G454=\"poniżej min.\",((VLOOKUP(E454,'Siatka płac'!$B$6:$D$17,3,FALSE)-C454)*(13-'Zestawienie stanowisk'!$H$1)),\"-\")","v":"-"}]
[0,null,null,null,{"$f":"IFERROR((VLOOKUP(B455,'Zestawienie stanowisk'!$B$5:$E$65,4,FALSE)),\"-\")","v":"-"},{"$f":"IFERROR(((C455-(VLOOKUP(E455,'Siatka płac'!$B$6:$E$17,3,FALSE)))/(VLOOKUP(E455,'Siatka płac'!$B$6:$E$17,4,FALSE)-VLOOKUP(E455,'Siatka płac'!$B$6:$E$17,3,FALSE))),\"-\")","v":"-"},"-",{"$f":"IF(G455=\"poniżej min.\",((VLOOKUP(E455,'Siatka płac'!$B$6:$D$17,3,FALSE)-C455)*(13-'Zestawienie stanowisk'!$H$1)),\"-\")","v":"-"}]
[0,null,null,null,{"$f":"IFERROR((VLOOKUP(B456,'Zestawienie stanowisk'!$B$5:$E$65,4,FALSE)),\"-\")","v":"-"},{"$f":"IFERROR(((C456-(VLOOKUP(E456,'Siatka płac'!$B$6:$E$17,3,FALSE)))/(VLOOKUP(E456,'Siatka płac'!$B$6:$E$17,4,FALSE)-VLOOKUP(E456,'Siatka płac'!$B$6:$E$17,3,FALSE))),\"-\")","v":"-"},"-",{"$f":"IF(G456=\"poniżej min.\",((VLOOKUP(E456,'Siatka płac'!$B$6:$D$17,3,FALSE)-C456)*(13-'Zestawienie stanowisk'!$H$1)),\"-\")","v":"-"}]
[0,null,null,null,{"$f":"IFERROR((VLOOKUP(B457,'Zestawienie stanowisk'!$B$5:$E$65,4,FALSE)),\"-\")","v":"-"},{"$f":"IFERROR(((C457-(VLOOKUP(E457,'Siatka płac'!$B$6:$E$17,3,FALSE)))/(VLOOKUP(E457,'Siatka płac'!$B$6:$E$17,4,FALSE)-VLOOKUP(E457,'Siatka płac'!$B$6:$E$17,3,FALSE))),\"-\")","v":"-"},"-",{"$f":"IF(G457=\"poniżej min.\",((VLOOKUP(E457,'Siatka płac'!$B$6:$D$17,3,FALSE)-C457)*(13-'Zestawienie stanowisk'!$H$1)),\"-\")","v":"-"}]
[0,null,null,null,{"$f":"IFERROR((VLOOKUP(B458,'Zestawienie stanowisk'!$B$5:$E$65,4,FALSE)),\"-\")","v":"-"},{"$f":"IFERROR(((C458-(VLOOKUP(E458,'Siatka płac'!$B$6:$E$17,3,FALSE)))/(VLOOKUP(E458,'Siatka płac'!$B$6:$E$17,4,FALSE)-VLOOKUP(E458,'Siatka płac'!$B$6:$E$17,3,FALSE))),\"-\")","v":"-"},"-",{"$f":"IF(G458=\"poniżej min.\",((VLOOKUP(E458,'Siatka płac'!$B$6:$D$17,3,FALSE)-C458)*(13-'Zestawienie stanowisk'!$H$1)),\"-\")","v":"-"}]
[0,null,null,null,{"$f":"IFERROR((VLOOKUP(B459,'Zestawienie stanowisk'!$B$5:$E$65,4,FALSE)),\"-\")","v":"-"},{"$f":"IFERROR(((C459-(VLOOKUP(E459,'Siatka płac'!$B$6:$E$17,3,FALSE)))/(VLOOKUP(E459,'Siatka płac'!$B$6:$E$17,4,FALSE)-VLOOKUP(E459,'Siatka płac'!$B$6:$E$17,3,FALSE))),\"-\")","v":"-"},"-",{"$f":"IF(G459=\"poniżej min.\",((VLOOKUP(E459,'Siatka płac'!$B$6:$D$17,3,FALSE)-C459)*(13-'Zestawienie stanowisk'!$H$1)),\"-\")","v":"-"}]
[0,null,null,null,{"$f":"IFERROR((VLOOKUP(B460,'Zestawienie stanowisk'!$B$5:$E$65,4,FALSE)),\"-\")","v":"-"},{"$f":"IFERROR(((C460-(VLOOKUP(E460,'Siatka płac'!$B$6:$E$17,3,FALSE)))/(VLOOKUP(E460,'Siatka płac'!$B$6:$E$17,4,FALSE)-VLOOKUP(E460,'Siatka płac'!$B$6:$E$17,3,FALSE))),\"-\")","v":"-"},"-",{"$f":"IF(G460=\"poniżej min.\",((VLOOKUP(E460,'Siatka płac'!$B$6:$D$17,3,FALSE)-C460)*(13-'Zestawienie stanowisk'!$H$1)),\"-\")","v":"-"}]
[0,null,null,null,{"$f":"IFERROR((VLOOKUP(B461,'Zestawienie stanowisk'!$B$5:$E$65,4,FALSE)),\"-\")","v":"-"},{"$f":"IFERROR(((C461-(VLOOKUP(E461,'Siatka płac'!$B$6:$E$17,3,FALSE)))/(VLOOKUP(E461,'Siatka płac'!$B$6:$E$17,4,FALSE)-VLOOKUP(E461,'Siatka płac'!$B$6:$E$17,3,FALSE))),\"-\")","v":"-"},"-",{"$f":"IF(G461=\"poniżej min.\",((VLOOKUP(E461,'Siatka płac'!$B$6:$D$17,3,FALSE)-C461)*(13-'Zestawienie stanowisk'!$H$1)),\"-\")","v":"-"}]
[0,null,null,null,{"$f":"IFERROR((VLOOKUP(B462,'Zestawienie stanowisk'!$B$5:$E$65,4,FALSE)),\"-\")","v":"-"},{"$f":"IFERROR(((C462-(VLOOKUP(E462,'Siatka płac'!$B$6:$E$17,3,FALSE)))/(VLOOKUP(E462,'Siatka płac'!$B$6:$E$17,4,FALSE)-VLOOKUP(E462,'Siatka płac'!$B$6:$E$17,3,FALSE))),\"-\")","v":"-"},"-",{"$f":"IF(G462=\"poniżej min.\",((VLOOKUP(E462,'Siatka płac'!$B$6:$D$17,3,FALSE)-C462)*(13-'Zestawienie stanowisk'!$H$1)),\"-\")","v":"-"}]
[0,null,null,null,{"$f":"IFERROR((VLOOKUP(B463,'Zestawienie stanowisk'!$B$5:$E$65,4,FALSE)),\"-\")","v":"-"},{"$f":"IFERROR(((C463-(VLOOKUP(E463,'Siatka płac'!$B$6:$E$17,3,FALSE)))/(VLOOKUP(E463,'Siatka płac'!$B$6:$E$17,4,FALSE)-VLOOKUP(E463,'Siatka płac'!$B$6:$E$17,3,FALSE))),\"-\")","v":"-"},"-",{"$f":"IF(G463=\"poniżej min.\",((VLOOKUP(E463,'Siatka płac'!$B$6:$D$17,3,FALSE)-C463)*(13-'Zestawienie stanowisk'!$H$1)),\"-\")","v":"-"}]
[0,null,null,null,{"$f":"IFERROR((VLOOKUP(B464,'Zestawienie stanowisk'!$B$5:$E$65,4,FALSE)),\"-\")","v":"-"},{"$f":"IFERROR(((C464-(VLOOKUP(E464,'Siatka płac'!$B$6:$E$17,3,FALSE)))/(VLOOKUP(E464,'Siatka płac'!$B$6:$E$17,4,FALSE)-VLOOKUP(E464,'Siatka płac'!$B$6:$E$17,3,FALSE))),\"-\")","v":"-"},"-",{"$f":"IF(G464=\"poniżej min.\",((VLOOKUP(E464,'Siatka płac'!$B$6:$D$17,3,FALSE)-C464)*(13-'Zestawienie stanowisk'!$H$1)),\"-\")","v":"-"}]
[0,null,null,null,{"$f":"IFERROR((VLOOKUP(B465,'Zestawienie stanowisk'!$B$5:$E$65,4,FALSE)),\"-\")","v":"-"},{"$f":"IFERROR(((C465-(VLOOKUP(E465,'Siatka płac'!$B$6:$E$17,3,FALSE)))/(VLOOKUP(E465,'Siatka płac'!$B$6:$E$17,4,FALSE)-VLOOKUP(E465,'Siatka płac'!$B$6:$E$17,3,FALSE))),\"-\")","v":"-"},"-",{"$f":"IF(G465=\"poniżej min.\",((VLOOKUP(E465,'Siatka płac'!$B$6:$D$17,3,FALSE)-C465)*(13-'Zestawienie stanowisk'!$H$1)),\"-\")","v":"-"}]
[0,null,null,null,{"$f":"IFERROR((VLOOKUP(B466,'Zestawienie stanowisk'!$B$5:$E$65,4,FALSE)),\"-\")","v":"-"},{"$f":"IFERROR(((C466-(VLOOKUP(E466,'Siatka płac'!$B$6:$E$17,3,FALSE)))/(VLOOKUP(E466,'Siatka płac'!$B$6:$E$17,4,FALSE)-VLOOKUP(E466,'Siatka płac'!$B$6:$E$17,3,FALSE))),\"-\")","v":"-"},"-",{"$f":"IF(G466=\"poniżej min.\",((VLOOKUP(E466,'Siatka płac'!$B$6:$D$17,3,FALSE)-C466)*(13-'Zestawienie stanowisk'!$H$1)),\"-\")","v":"-"}]
[0,null,null,null,{"$f":"IFERROR((VLOOKUP(B467,'Zestawienie stanowisk'!$B$5:$E$65,4,FALSE)),\"-\")","v":"-"},{"$f":"IFERROR(((C467-(VLOOKUP(E467,'Siatka płac'!$B$6:$E$17,3,FALSE)))/(VLOOKUP(E467,'Siatka płac'!$B$6:$E$17,4,FALSE)-VLOOKUP(E467,'Siatka płac'!$B$6:$E$17,3,FALSE))),\"-\")","v":"-"},"-",{"$f":"IF(G467=\"poniżej min.\",((VLOOKUP(E467,'Siatka płac'!$B$6:$D$17,3,FALSE)-C467)*(13-'Zestawienie stanowisk'!$H$1)),\"-\")","v":"-"}]
[0,null,null,null,{"$f":"IFERROR((VLOOKUP(B468,'Zestawienie stanowisk'!$B$5:$E$65,4,FALSE)),\"-\")","v":"-"},{"$f":"IFERROR(((C468-(VLOOKUP(E468,'Siatka płac'!$B$6:$E$17,3,FALSE)))/(VLOOKUP(E468,'Siatka płac'!$B$6:$E$17,4,FALSE)-VLOOKUP(E468,'Siatka płac'!$B$6:$E$17,3,FALSE))),\"-\")","v":"-"},"-",{"$f":"IF(G468=\"poniżej min.\",((VLOOKUP(E468,'Siatka płac'!$B$6:$D$17,3,FALSE)-C468)*(13-'Zestawienie stanowisk'!$H$1)),\"-\")","v":"-"}]
[0,null,null,null,{"$f":"IFERROR((VLOOKUP(B469,'Zestawienie stanowisk'!$B$5:$E$65,4,FALSE)),\"-\")","v":"-"},{"$f":"IFERROR(((C469-(VLOOKUP(E469,'Siatka płac'!$B$6:$E$17,3,FALSE)))/(VLOOKUP(E469,'Siatka płac'!$B$6:$E$17,4,FALSE)-VLOOKUP(E469,'Siatka płac'!$B$6:$E$17,3,FALSE))),\"-\")","v":"-"},"-",{"$f":"IF(G469=\"poniżej min.\",((VLOOKUP(E469,'Siatka płac'!$B$6:$D$17,3,FALSE)-C469)*(13-'Zestawienie stanowisk'!$H$1)),\"-\")","v":"-"}]
[0,null,null,null,{"$f":"IFERROR((VLOOKUP(B470,'Zestawienie stanowisk'!$B$5:$E$65,4,FALSE)),\"-\")","v":"-"},{"$f":"IFERROR(((C470-(VLOOKUP(E470,'Siatka płac'!$B$6:$E$17,3,FALSE)))/(VLOOKUP(E470,'Siatka płac'!$B$6:$E$17,4,FALSE)-VLOOKUP(E470,'Siatka płac'!$B$6:$E$17,3,FALSE))),\"-\")","v":"-"},"-",{"$f":"IF(G470=\"poniżej min.\",((VLOOKUP(E470,'Siatka płac'!$B$6:$D$17,3,FALSE)-C470)*(13-'Zestawienie stanowisk'!$H$1)),\"-\")","v":"-"}]
[0,null,null,null,{"$f":"IFERROR((VLOOKUP(B471,'Zestawienie stanowisk'!$B$5:$E$65,4,FALSE)),\"-\")","v":"-"},{"$f":"IFERROR(((C471-(VLOOKUP(E471,'Siatka płac'!$B$6:$E$17,3,FALSE)))/(VLOOKUP(E471,'Siatka płac'!$B$6:$E$17,4,FALSE)-VLOOKUP(E471,'Siatka płac'!$B$6:$E$17,3,FALSE))),\"-\")","v":"-"},"-",{"$f":"IF(G471=\"poniżej min.\",((VLOOKUP(E471,'Siatka płac'!$B$6:$D$17,3,FALSE)-C471)*(13-'Zestawienie stanowisk'!$H$1)),\"-\")","v":"-"}]
[0,null,null,null,{"$f":"IFERROR((VLOOKUP(B472,'Zestawienie stanowisk'!$B$5:$E$65,4,FALSE)),\"-\")","v":"-"},{"$f":"IFERROR(((C472-(VLOOKUP(E472,'Siatka płac'!$B$6:$E$17,3,FALSE)))/(VLOOKUP(E472,'Siatka płac'!$B$6:$E$17,4,FALSE)-VLOOKUP(E472,'Siatka płac'!$B$6:$E$17,3,FALSE))),\"-\")","v":"-"},"-",{"$f":"IF(G472=\"poniżej min.\",((VLOOKUP(E472,'Siatka płac'!$B$6:$D$17,3,FALSE)-C472)*(13-'Zestawienie stanowisk'!$H$1)),\"-\")","v":"-"}]
[0,null,null,null,{"$f":"IFERROR((VLOOKUP(B473,'Zestawienie stanowisk'!$B$5:$E$65,4,FALSE)),\"-\")","v":"-"},{"$f":"IFERROR(((C473-(VLOOKUP(E473,'Siatka płac'!$B$6:$E$17,3,FALSE)))/(VLOOKUP(E473,'Siatka płac'!$B$6:$E$17,4,FALSE)-VLOOKUP(E473,'Siatka płac'!$B$6:$E$17,3,FALSE))),\"-\")","v":"-"},"-",{"$f":"IF(G473=\"poniżej min.\",((VLOOKUP(E473,'Siatka płac'!$B$6:$D$17,3,FALSE)-C473)*(13-'Zestawienie stanowisk'!$H$1)),\"-\")","v":"-"}]
[0,null,null,null,{"$f":"IFERROR((VLOOKUP(B474,'Zestawienie stanowisk'!$B$5:$E$65,4,FALSE)),\"-\")","v":"-"},{"$f":"IFERROR(((C474-(VLOOKUP(E474,'Siatka płac'!$B$6:$E$17,3,FALSE)))/(VLOOKUP(E474,'Siatka płac'!$B$6:$E$17,4,FALSE)-VLOOKUP(E474,'Siatka płac'!$B$6:$E$17,3,FALSE))),\"-\")","v":"-"},"-",{"$f":"IF(G474=\"poniżej min.\",((VLOOKUP(E474,'Siatka płac'!$B$6:$D$17,3,FALSE)-C474)*(13-'Zestawienie stanowisk'!$H$1)),\"-\")","v":"-"}]
[0,null,null,null,{"$f":"IFERROR((VLOOKUP(B475,'Zestawienie stanowisk'!$B$5:$E$65,4,FALSE)),\"-\")","v":"-"},{"$f":"IFERROR(((C475-(VLOOKUP(E475,'Siatka płac'!$B$6:$E$17,3,FALSE)))/(VLOOKUP(E475,'Siatka płac'!$B$6:$E$17,4,FALSE)-VLOOKUP(E475,'Siatka płac'!$B$6:$E$17,3,FALSE))),\"-\")","v":"-"},"-",{"$f":"IF(G475=\"poniżej min.\",((VLOOKUP(E475,'Siatka płac'!$B$6:$D$17,3,FALSE)-C475)*(13-'Zestawienie stanowisk'!$H$1)),\"-\")","v":"-"}]
[0,null,null,null,{"$f":"IFERROR((VLOOKUP(B476,'Zestawienie stanowisk'!$B$5:$E$65,4,FALSE)),\"-\")","v":"-"},{"$f":"IFERROR(((C476-(VLOOKUP(E476,'Siatka płac'!$B$6:$E$17,3,FALSE)))/(VLOOKUP(E476,'Siatka płac'!$B$6:$E$17,4,FALSE)-VLOOKUP(E476,'Siatka płac'!$B$6:$E$17,3,FALSE))),\"-\")","v":"-"},"-",{"$f":"IF(G476=\"poniżej min.\",((VLOOKUP(E476,'Siatka płac'!$B$6:$D$17,3,FALSE)-C476)*(13-'Zestawienie stanowisk'!$H$1)),\"-\")","v":"-"}]
[0,null,null,null,{"$f":"IFERROR((VLOOKUP(B477,'Zestawienie stanowisk'!$B$5:$E$65,4,FALSE)),\"-\")","v":"-"},{"$f":"IFERROR(((C477-(VLOOKUP(E477,'Siatka płac'!$B$6:$E$17,3,FALSE)))/(VLOOKUP(E477,'Siatka płac'!$B$6:$E$17,4,FALSE)-VLOOKUP(E477,'Siatka płac'!$B$6:$E$17,3,FALSE))),\"-\")","v":"-"},"-",{"$f":"IF(G477=\"poniżej min.\",((VLOOKUP(E477,'Siatka płac'!$B$6:$D$17,3,FALSE)-C477)*(13-'Zestawienie stanowisk'!$H$1)),\"-\")","v":"-"}]
[0,null,null,null,{"$f":"IFERROR((VLOOKUP(B478,'Zestawienie stanowisk'!$B$5:$E$65,4,FALSE)),\"-\")","v":"-"},{"$f":"IFERROR(((C478-(VLOOKUP(E478,'Siatka płac'!$B$6:$E$17,3,FALSE)))/(VLOOKUP(E478,'Siatka płac'!$B$6:$E$17,4,FALSE)-VLOOKUP(E478,'Siatka płac'!$B$6:$E$17,3,FALSE))),\"-\")","v":"-"},"-",{"$f":"IF(G478=\"poniżej min.\",((VLOOKUP(E478,'Siatka płac'!$B$6:$D$17,3,FALSE)-C478)*(13-'Zestawienie stanowisk'!$H$1)),\"-\")","v":"-"}]
[0,null,null,null,{"$f":"IFERROR((VLOOKUP(B479,'Zestawienie stanowisk'!$B$5:$E$65,4,FALSE)),\"-\")","v":"-"},{"$f":"IFERROR(((C479-(VLOOKUP(E479,'Siatka płac'!$B$6:$E$17,3,FALSE)))/(VLOOKUP(E479,'Siatka płac'!$B$6:$E$17,4,FALSE)-VLOOKUP(E479,'Siatka płac'!$B$6:$E$17,3,FALSE))),\"-\")","v":"-"},"-",{"$f":"IF(G479=\"poniżej min.\",((VLOOKUP(E479,'Siatka płac'!$B$6:$D$17,3,FALSE)-C479)*(13-'Zestawienie stanowisk'!$H$1)),\"-\")","v":"-"}]
[0,null,null,null,{"$f":"IFERROR((VLOOKUP(B480,'Zestawienie stanowisk'!$B$5:$E$65,4,FALSE)),\"-\")","v":"-"},{"$f":"IFERROR(((C480-(VLOOKUP(E480,'Siatka płac'!$B$6:$E$17,3,FALSE)))/(VLOOKUP(E480,'Siatka płac'!$B$6:$E$17,4,FALSE)-VLOOKUP(E480,'Siatka płac'!$B$6:$E$17,3,FALSE))),\"-\")","v":"-"},"-",{"$f":"IF(G480=\"poniżej min.\",((VLOOKUP(E480,'Siatka płac'!$B$6:$D$17,3,FALSE)-C480)*(13-'Zestawienie stanowisk'!$H$1)),\"-\")","v":"-"}]
[0,null,null,null,{"$f":"IFERROR((VLOOKUP(B481,'Zestawienie stanowisk'!$B$5:$E$65,4,FALSE)),\"-\")","v":"-"},{"$f":"IFERROR(((C481-(VLOOKUP(E481,'Siatka płac'!$B$6:$E$17,3,FALSE)))/(VLOOKUP(E481,'Siatka płac'!$B$6:$E$17,4,FALSE)-VLOOKUP(E481,'Siatka płac'!$B$6:$E$17,3,FALSE))),\"-\")","v":"-"},"-",{"$f":"IF(G481=\"poniżej min.\",((VLOOKUP(E481,'Siatka płac'!$B$6:$D$17,3,FALSE)-C481)*(13-'Zestawienie stanowisk'!$H$1)),\"-\")","v":"-"}]
[0,null,null,null,{"$f":"IFERROR((VLOOKUP(B482,'Zestawienie stanowisk'!$B$5:$E$65,4,FALSE)),\"-\")","v":"-"},{"$f":"IFERROR(((C482-(VLOOKUP(E482,'Siatka płac'!$B$6:$E$17,3,FALSE)))/(VLOOKUP(E482,'Siatka płac'!$B$6:$E$17,4,FALSE)-VLOOKUP(E482,'Siatka płac'!$B$6:$E$17,3,FALSE))),\"-\")","v":"-"},"-",{"$f":"IF(G482=\"poniżej min.\",((VLOOKUP(E482,'Siatka płac'!$B$6:$D$17,3,FALSE)-C482)*(13-'Zestawienie stanowisk'!$H$1)),\"-\")","v":"-"}]
[0,null,null,null,{"$f":"IFERROR((VLOOKUP(B483,'Zestawienie stanowisk'!$B$5:$E$65,4,FALSE)),\"-\")","v":"-"},{"$f":"IFERROR(((C483-(VLOOKUP(E483,'Siatka płac'!$B$6:$E$17,3,FALSE)))/(VLOOKUP(E483,'Siatka płac'!$B$6:$E$17,4,FALSE)-VLOOKUP(E483,'Siatka płac'!$B$6:$E$17,3,FALSE))),\"-\")","v":"-"},"-",{"$f":"IF(G483=\"poniżej min.\",((VLOOKUP(E483,'Siatka płac'!$B$6:$D$17,3,FALSE)-C483)*(13-'Zestawienie stanowisk'!$H$1)),\"-\")","v":"-"}]
[0,null,null,null,{"$f":"IFERROR((VLOOKUP(B484,'Zestawienie stanowisk'!$B$5:$E$65,4,FALSE)),\"-\")","v":"-"},{"$f":"IFERROR(((C484-(VLOOKUP(E484,'Siatka płac'!$B$6:$E$17,3,FALSE)))/(VLOOKUP(E484,'Siatka płac'!$B$6:$E$17,4,FALSE)-VLOOKUP(E484,'Siatka płac'!$B$6:$E$17,3,FALSE))),\"-\")","v":"-"},"-",{"$f":"IF(G484=\"poniżej min.\",((VLOOKUP(E484,'Siatka płac'!$B$6:$D$17,3,FALSE)-C484)*(13-'Zestawienie stanowisk'!$H$1)),\"-\")","v":"-"}]
[0,null,null,null,{"$f":"IFERROR((VLOOKUP(B485,'Zestawienie stanowisk'!$B$5:$E$65,4,FALSE)),\"-\")","v":"-"},{"$f":"IFERROR(((C485-(VLOOKUP(E485,'Siatka płac'!$B$6:$E$17,3,FALSE)))/(VLOOKUP(E485,'Siatka płac'!$B$6:$E$17,4,FALSE)-VLOOKUP(E485,'Siatka płac'!$B$6:$E$17,3,FALSE))),\"-\")","v":"-"},"-",{"$f":"IF(G485=\"poniżej min.\",((VLOOKUP(E485,'Siatka płac'!$B$6:$D$17,3,FALSE)-C485)*(13-'Zestawienie stanowisk'!$H$1)),\"-\")","v":"-"}]
[0,null,null,null,{"$f":"IFERROR((VLOOKUP(B486,'Zestawienie stanowisk'!$B$5:$E$65,4,FALSE)),\"-\")","v":"-"},{"$f":"IFERROR(((C486-(VLOOKUP(E486,'Siatka płac'!$B$6:$E$17,3,FALSE)))/(VLOOKUP(E486,'Siatka płac'!$B$6:$E$17,4,FALSE)-VLOOKUP(E486,'Siatka płac'!$B$6:$E$17,3,FALSE))),\"-\")","v":"-"},"-",{"$f":"IF(G486=\"poniżej min.\",((VLOOKUP(E486,'Siatka płac'!$B$6:$D$17,3,FALSE)-C486)*(13-'Zestawienie stanowisk'!$H$1)),\"-\")","v":"-"}]
[0,null,null,null,{"$f":"IFERROR((VLOOKUP(B487,'Zestawienie stanowisk'!$B$5:$E$65,4,FALSE)),\"-\")","v":"-"},{"$f":"IFERROR(((C487-(VLOOKUP(E487,'Siatka płac'!$B$6:$E$17,3,FALSE)))/(VLOOKUP(E487,'Siatka płac'!$B$6:$E$17,4,FALSE)-VLOOKUP(E487,'Siatka płac'!$B$6:$E$17,3,FALSE))),\"-\")","v":"-"},"-",{"$f":"IF(G487=\"poniżej min.\",((VLOOKUP(E487,'Siatka płac'!$B$6:$D$17,3,FALSE)-C487)*(13-'Zestawienie stanowisk'!$H$1)),\"-\")","v":"-"}]
[0,null,null,null,{"$f":"IFERROR((VLOOKUP(B488,'Zestawienie stanowisk'!$B$5:$E$65,4,FALSE)),\"-\")","v":"-"},{"$f":"IFERROR(((C488-(VLOOKUP(E488,'Siatka płac'!$B$6:$E$17,3,FALSE)))/(VLOOKUP(E488,'Siatka płac'!$B$6:$E$17,4,FALSE)-VLOOKUP(E488,'Siatka płac'!$B$6:$E$17,3,FALSE))),\"-\")","v":"-"},"-",{"$f":"IF(G488=\"poniżej min.\",((VLOOKUP(E488,'Siatka płac'!$B$6:$D$17,3,FALSE)-C488)*(13-'Zestawienie stanowisk'!$H$1)),\"-\")","v":"-"}]
[0,null,null,null,{"$f":"IFERROR((VLOOKUP(B489,'Zestawienie stanowisk'!$B$5:$E$65,4,FALSE)),\"-\")","v":"-"},{"$f":"IFERROR(((C489-(VLOOKUP(E489,'Siatka płac'!$B$6:$E$17,3,FALSE)))/(VLOOKUP(E489,'Siatka płac'!$B$6:$E$17,4,FALSE)-VLOOKUP(E489,'Siatka płac'!$B$6:$E$17,3,FALSE))),\"-\")","v":"-"},"-",{"$f":"IF(G489=\"poniżej min.\",((VLOOKUP(E489,'Siatka płac'!$B$6:$D$17,3,FALSE)-C489)*(13-'Zestawienie stanowisk'!$H$1)),\"-\")","v":"-"}]
[0,null,null,null,{"$f":"IFERROR((VLOOKUP(B490,'Zestawienie stanowisk'!$B$5:$E$65,4,FALSE)),\"-\")","v":"-"},{"$f":"IFERROR(((C490-(VLOOKUP(E490,'Siatka płac'!$B$6:$E$17,3,FALSE)))/(VLOOKUP(E490,'Siatka płac'!$B$6:$E$17,4,FALSE)-VLOOKUP(E490,'Siatka płac'!$B$6:$E$17,3,FALSE))),\"-\")","v":"-"},"-",{"$f":"IF(G490=\"poniżej min.\",((VLOOKUP(E490,'Siatka płac'!$B$6:$D$17,3,FALSE)-C490)*(13-'Zestawienie stanowisk'!$H$1)),\"-\")","v":"-"}]
[0,null,null,null,{"$f":"IFERROR((VLOOKUP(B491,'Zestawienie stanowisk'!$B$5:$E$65,4,FALSE)),\"-\")","v":"-"},{"$f":"IFERROR(((C491-(VLOOKUP(E491,'Siatka płac'!$B$6:$E$17,3,FALSE)))/(VLOOKUP(E491,'Siatka płac'!$B$6:$E$17,4,FALSE)-VLOOKUP(E491,'Siatka płac'!$B$6:$E$17,3,FALSE))),\"-\")","v":"-"},"-",{"$f":"IF(G491=\"poniżej min.\",((VLOOKUP(E491,'Siatka płac'!$B$6:$D$17,3,FALSE)-C491)*(13-'Zestawienie stanowisk'!$H$1)),\"-\")","v":"-"}]
[0,null,null,null,{"$f":"IFERROR((VLOOKUP(B492,'Zestawienie stanowisk'!$B$5:$E$65,4,FALSE)),\"-\")","v":"-"},{"$f":"IFERROR(((C492-(VLOOKUP(E492,'Siatka płac'!$B$6:$E$17,3,FALSE)))/(VLOOKUP(E492,'Siatka płac'!$B$6:$E$17,4,FALSE)-VLOOKUP(E492,'Siatka płac'!$B$6:$E$17,3,FALSE))),\"-\")","v":"-"},"-",{"$f":"IF(G492=\"poniżej min.\",((VLOOKUP(E492,'Siatka płac'!$B$6:$D$17,3,FALSE)-C492)*(13-'Zestawienie stanowisk'!$H$1)),\"-\")","v":"-"}]
[0,null,null,null,{"$f":"IFERROR((VLOOKUP(B493,'Zestawienie stanowisk'!$B$5:$E$65,4,FALSE)),\"-\")","v":"-"},{"$f":"IFERROR(((C493-(VLOOKUP(E493,'Siatka płac'!$B$6:$E$17,3,FALSE)))/(VLOOKUP(E493,'Siatka płac'!$B$6:$E$17,4,FALSE)-VLOOKUP(E493,'Siatka płac'!$B$6:$E$17,3,FALSE))),\"-\")","v":"-"},"-",{"$f":"IF(G493=\"poniżej min.\",((VLOOKUP(E493,'Siatka płac'!$B$6:$D$17,3,FALSE)-C493)*(13-'Zestawienie stanowisk'!$H$1)),\"-\")","v":"-"}]
[0,null,null,null,{"$f":"IFERROR((VLOOKUP(B494,'Zestawienie stanowisk'!$B$5:$E$65,4,FALSE)),\"-\")","v":"-"},{"$f":"IFERROR(((C494-(VLOOKUP(E494,'Siatka płac'!$B$6:$E$17,3,FALSE)))/(VLOOKUP(E494,'Siatka płac'!$B$6:$E$17,4,FALSE)-VLOOKUP(E494,'Siatka płac'!$B$6:$E$17,3,FALSE))),\"-\")","v":"-"},"-",{"$f":"IF(G494=\"poniżej min.\",((VLOOKUP(E494,'Siatka płac'!$B$6:$D$17,3,FALSE)-C494)*(13-'Zestawienie stanowisk'!$H$1)),\"-\")","v":"-"}]
[0,null,null,null,{"$f":"IFERROR((VLOOKUP(B495,'Zestawienie stanowisk'!$B$5:$E$65,4,FALSE)),\"-\")","v":"-"},{"$f":"IFERROR(((C495-(VLOOKUP(E495,'Siatka płac'!$B$6:$E$17,3,FALSE)))/(VLOOKUP(E495,'Siatka płac'!$B$6:$E$17,4,FALSE)-VLOOKUP(E495,'Siatka płac'!$B$6:$E$17,3,FALSE))),\"-\")","v":"-"},"-",{"$f":"IF(G495=\"poniżej min.\",((VLOOKUP(E495,'Siatka płac'!$B$6:$D$17,3,FALSE)-C495)*(13-'Zestawienie stanowisk'!$H$1)),\"-\")","v":"-"}]
[0,null,null,null,{"$f":"IFERROR((VLOOKUP(B496,'Zestawienie stanowisk'!$B$5:$E$65,4,FALSE)),\"-\")","v":"-"},{"$f":"IFERROR(((C496-(VLOOKUP(E496,'Siatka płac'!$B$6:$E$17,3,FALSE)))/(VLOOKUP(E496,'Siatka płac'!$B$6:$E$17,4,FALSE)-VLOOKUP(E496,'Siatka płac'!$B$6:$E$17,3,FALSE))),\"-\")","v":"-"},"-",{"$f":"IF(G496=\"poniżej min.\",((VLOOKUP(E496,'Siatka płac'!$B$6:$D$17,3,FALSE)-C496)*(13-'Zestawienie stanowisk'!$H$1)),\"-\")","v":"-"}]
[0,null,null,null,{"$f":"IFERROR((VLOOKUP(B497,'Zestawienie stanowisk'!$B$5:$E$65,4,FALSE)),\"-\")","v":"-"},{"$f":"IFERROR(((C497-(VLOOKUP(E497,'Siatka płac'!$B$6:$E$17,3,FALSE)))/(VLOOKUP(E497,'Siatka płac'!$B$6:$E$17,4,FALSE)-VLOOKUP(E497,'Siatka płac'!$B$6:$E$17,3,FALSE))),\"-\")","v":"-"},"-",{"$f":"IF(G497=\"poniżej min.\",((VLOOKUP(E497,'Siatka płac'!$B$6:$D$17,3,FALSE)-C497)*(13-'Zestawienie stanowisk'!$H$1)),\"-\")","v":"-"}]
[0,null,null,null,{"$f":"IFERROR((VLOOKUP(B498,'Zestawienie stanowisk'!$B$5:$E$65,4,FALSE)),\"-\")","v":"-"},{"$f":"IFERROR(((C498-(VLOOKUP(E498,'Siatka płac'!$B$6:$E$17,3,FALSE)))/(VLOOKUP(E498,'Siatka płac'!$B$6:$E$17,4,FALSE)-VLOOKUP(E498,'Siatka płac'!$B$6:$E$17,3,FALSE))),\"-\")","v":"-"},"-",{"$f":"IF(G498=\"poniżej min.\",((VLOOKUP(E498,'Siatka płac'!$B$6:$D$17,3,FALSE)-C498)*(13-'Zestawienie stanowisk'!$H$1)),\"-\")","v":"-"}]
[0,null,null,null,{"$f":"IFERROR((VLOOKUP(B499,'Zestawienie stanowisk'!$B$5:$E$65,4,FALSE)),\"-\")","v":"-"},{"$f":"IFERROR(((C499-(VLOOKUP(E499,'Siatka płac'!$B$6:$E$17,3,FALSE)))/(VLOOKUP(E499,'Siatka płac'!$B$6:$E$17,4,FALSE)-VLOOKUP(E499,'Siatka płac'!$B$6:$E$17,3,FALSE))),\"-\")","v":"-"},"-",{"$f":"IF(G499=\"poniżej min.\",((VLOOKUP(E499,'Siatka płac'!$B$6:$D$17,3,FALSE)-C499)*(13-'Zestawienie stanowisk'!$H$1)),\"-\")","v":"-"}]
[0,null,null,null,{"$f":"IFERROR((VLOOKUP(B500,'Zestawienie stanowisk'!$B$5:$E$65,4,FALSE)),\"-\")","v":"-"},{"$f":"IFERROR(((C500-(VLOOKUP(E500,'Siatka płac'!$B$6:$E$17,3,FALSE)))/(VLOOKUP(E500,'Siatka płac'!$B$6:$E$17,4,FALSE)-VLOOKUP(E500,'Siatka płac'!$B$6:$E$17,3,FALSE))),\"-\")","v":"-"},"-",{"$f":"IF(G500=\"poniżej min.\",((VLOOKUP(E500,'Siatka płac'!$B$6:$D$17,3,FALSE)-C500)*(13-'Zestawienie stanowisk'!$H$1)),\"-\")","v":"-"}]
[0,null,null,null,{"$f":"IFERROR((VLOOKUP(B501,'Zestawienie stanowisk'!$B$5:$E$65,4,FALSE)),\"-\")","v":"-"},{"$f":"IFERROR(((C501-(VLOOKUP(E501,'Siatka płac'!$B$6:$E$17,3,FALSE)))/(VLOOKUP(E501,'Siatka płac'!$B$6:$E$17,4,FALSE)-VLOOKUP(E501,'Siatka płac'!$B$6:$E$17,3,FALSE))),\"-\")","v":"-"},"-",{"$f":"IF(G501=\"poniżej min.\",((VLOOKUP(E501,'Siatka płac'!$B$6:$D$17,3,FALSE)-C501)*(13-'Zestawienie stanowisk'!$H$1)),\"-\")","v":"-"}]
[0,null,null,null,{"$f":"IFERROR((VLOOKUP(B502,'Zestawienie stanowisk'!$B$5:$E$65,4,FALSE)),\"-\")","v":"-"},{"$f":"IFERROR(((C502-(VLOOKUP(E502,'Siatka płac'!$B$6:$E$17,3,FALSE)))/(VLOOKUP(E502,'Siatka płac'!$B$6:$E$17,4,FALSE)-VLOOKUP(E502,'Siatka płac'!$B$6:$E$17,3,FALSE))),\"-\")","v":"-"},"-",{"$f":"IF(G502=\"poniżej min.\",((VLOOKUP(E502,'Siatka płac'!$B$6:$D$17,3,FALSE)-C502)*(13-'Zestawienie stanowisk'!$H$1)),\"-\")","v":"-"}]
[0,null,null,null,{"$f":"IFERROR((VLOOKUP(B503,'Zestawienie stanowisk'!$B$5:$E$65,4,FALSE)),\"-\")","v":"-"},{"$f":"IFERROR(((C503-(VLOOKUP(E503,'Siatka płac'!$B$6:$E$17,3,FALSE)))/(VLOOKUP(E503,'Siatka płac'!$B$6:$E$17,4,FALSE)-VLOOKUP(E503,'Siatka płac'!$B$6:$E$17,3,FALSE))),\"-\")","v":"-"},"-",{"$f":"IF(G503=\"poniżej min.\",((VLOOKUP(E503,'Siatka płac'!$B$6:$D$17,3,FALSE)-C503)*(13-'Zestawienie stanowisk'!$H$1)),\"-\")","v":"-"}]
[0,null,null,null,{"$f":"IFERROR((VLOOKUP(B504,'Zestawienie stanowisk'!$B$5:$E$65,4,FALSE)),\"-\")","v":"-"},{"$f":"IFERROR(((C504-(VLOOKUP(E504,'Siatka płac'!$B$6:$E$17,3,FALSE)))/(VLOOKUP(E504,'Siatka płac'!$B$6:$E$17,4,FALSE)-VLOOKUP(E504,'Siatka płac'!$B$6:$E$17,3,FALSE))),\"-\")","v":"-"},"-",{"$f":"IF(G504=\"poniżej min.\",((VLOOKUP(E504,'Siatka płac'!$B$6:$D$17,3,FALSE)-C504)*(13-'Zestawienie stanowisk'!$H$1)),\"-\")","v":"-"}]
[0,null,null,null,{"$f":"IFERROR((VLOOKUP(B505,'Zestawienie stanowisk'!$B$5:$E$65,4,FALSE)),\"-\")","v":"-"},{"$f":"IFERROR(((C505-(VLOOKUP(E505,'Siatka płac'!$B$6:$E$17,3,FALSE)))/(VLOOKUP(E505,'Siatka płac'!$B$6:$E$17,4,FALSE)-VLOOKUP(E505,'Siatka płac'!$B$6:$E$17,3,FALSE))),\"-\")","v":"-"},"-",{"$f":"IF(G505=\"poniżej min.\",((VLOOKUP(E505,'Siatka płac'!$B$6:$D$17,3,FALSE)-C505)*(13-'Zestawienie stanowisk'!$H$1)),\"-\")","v":"-"}]
[0,null,null,null,{"$f":"IFERROR((VLOOKUP(B506,'Zestawienie stanowisk'!$B$5:$E$65,4,FALSE)),\"-\")","v":"-"},{"$f":"IFERROR(((C506-(VLOOKUP(E506,'Siatka płac'!$B$6:$E$17,3,FALSE)))/(VLOOKUP(E506,'Siatka płac'!$B$6:$E$17,4,FALSE)-VLOOKUP(E506,'Siatka płac'!$B$6:$E$17,3,FALSE))),\"-\")","v":"-"},"-",{"$f":"IF(G506=\"poniżej min.\",((VLOOKUP(E506,'Siatka płac'!$B$6:$D$17,3,FALSE)-C506)*(13-'Zestawienie stanowisk'!$H$1)),\"-\")","v":"-"}]
[0,null,null,null,{"$f":"IFERROR((VLOOKUP(B507,'Zestawienie stanowisk'!$B$5:$E$65,4,FALSE)),\"-\")","v":"-"},{"$f":"IFERROR(((C507-(VLOOKUP(E507,'Siatka płac'!$B$6:$E$17,3,FALSE)))/(VLOOKUP(E507,'Siatka płac'!$B$6:$E$17,4,FALSE)-VLOOKUP(E507,'Siatka płac'!$B$6:$E$17,3,FALSE))),\"-\")","v":"-"},"-",{"$f":"IF(G507=\"poniżej min.\",((VLOOKUP(E507,'Siatka płac'!$B$6:$D$17,3,FALSE)-C507)*(13-'Zestawienie stanowisk'!$H$1)),\"-\")","v":"-"}]
[0,null,null,null,{"$f":"IFERROR((VLOOKUP(B508,'Zestawienie stanowisk'!$B$5:$E$65,4,FALSE)),\"-\")","v":"-"},{"$f":"IFERROR(((C508-(VLOOKUP(E508,'Siatka płac'!$B$6:$E$17,3,FALSE)))/(VLOOKUP(E508,'Siatka płac'!$B$6:$E$17,4,FALSE)-VLOOKUP(E508,'Siatka płac'!$B$6:$E$17,3,FALSE))),\"-\")","v":"-"},"-",{"$f":"IF(G508=\"poniżej min.\",((VLOOKUP(E508,'Siatka płac'!$B$6:$D$17,3,FALSE)-C508)*(13-'Zestawienie stanowisk'!$H$1)),\"-\")","v":"-"}]
[0,null,null,null,{"$f":"IFERROR((VLOOKUP(B509,'Zestawienie stanowisk'!$B$5:$E$65,4,FALSE)),\"-\")","v":"-"},{"$f":"IFERROR(((C509-(VLOOKUP(E509,'Siatka płac'!$B$6:$E$17,3,FALSE)))/(VLOOKUP(E509,'Siatka płac'!$B$6:$E$17,4,FALSE)-VLOOKUP(E509,'Siatka płac'!$B$6:$E$17,3,FALSE))),\"-\")","v":"-"},"-",{"$f":"IF(G509=\"poniżej min.\",((VLOOKUP(E509,'Siatka płac'!$B$6:$D$17,3,FALSE)-C509)*(13-'Zestawienie stanowisk'!$H$1)),\"-\")","v":"-"}]
[0,null,null,null,{"$f":"IFERROR((VLOOKUP(B510,'Zestawienie stanowisk'!$B$5:$E$65,4,FALSE)),\"-\")","v":"-"},{"$f":"IFERROR(((C510-(VLOOKUP(E510,'Siatka płac'!$B$6:$E$17,3,FALSE)))/(VLOOKUP(E510,'Siatka płac'!$B$6:$E$17,4,FALSE)-VLOOKUP(E510,'Siatka płac'!$B$6:$E$17,3,FALSE))),\"-\")","v":"-"},"-",{"$f":"IF(G510=\"poniżej min.\",((VLOOKUP(E510,'Siatka płac'!$B$6:$D$17,3,FALSE)-C510)*(13-'Zestawienie stanowisk'!$H$1)),\"-\")","v":"-"}]
[0,null,null,null,{"$f":"IFERROR((VLOOKUP(B511,'Zestawienie stanowisk'!$B$5:$E$65,4,FALSE)),\"-\")","v":"-"},{"$f":"IFERROR(((C511-(VLOOKUP(E511,'Siatka płac'!$B$6:$E$17,3,FALSE)))/(VLOOKUP(E511,'Siatka płac'!$B$6:$E$17,4,FALSE)-VLOOKUP(E511,'Siatka płac'!$B$6:$E$17,3,FALSE))),\"-\")","v":"-"},"-",{"$f":"IF(G511=\"poniżej min.\",((VLOOKUP(E511,'Siatka płac'!$B$6:$D$17,3,FALSE)-C511)*(13-'Zestawienie stanowisk'!$H$1)),\"-\")","v":"-"}]
[0,null,null,null,{"$f":"IFERROR((VLOOKUP(B512,'Zestawienie stanowisk'!$B$5:$E$65,4,FALSE)),\"-\")","v":"-"},{"$f":"IFERROR(((C512-(VLOOKUP(E512,'Siatka płac'!$B$6:$E$17,3,FALSE)))/(VLOOKUP(E512,'Siatka płac'!$B$6:$E$17,4,FALSE)-VLOOKUP(E512,'Siatka płac'!$B$6:$E$17,3,FALSE))),\"-\")","v":"-"},"-",{"$f":"IF(G512=\"poniżej min.\",((VLOOKUP(E512,'Siatka płac'!$B$6:$D$17,3,FALSE)-C512)*(13-'Zestawienie stanowisk'!$H$1)),\"-\")","v":"-"}]
[0,null,null,null,{"$f":"IFERROR((VLOOKUP(B513,'Zestawienie stanowisk'!$B$5:$E$65,4,FALSE)),\"-\")","v":"-"},{"$f":"IFERROR(((C513-(VLOOKUP(E513,'Siatka płac'!$B$6:$E$17,3,FALSE)))/(VLOOKUP(E513,'Siatka płac'!$B$6:$E$17,4,FALSE)-VLOOKUP(E513,'Siatka płac'!$B$6:$E$17,3,FALSE))),\"-\")","v":"-"},"-",{"$f":"IF(G513=\"poniżej min.\",((VLOOKUP(E513,'Siatka płac'!$B$6:$D$17,3,FALSE)-C513)*(13-'Zestawienie stanowisk'!$H$1)),\"-\")","v":"-"}]
[0,null,null,null,{"$f":"IFERROR((VLOOKUP(B514,'Zestawienie stanowisk'!$B$5:$E$65,4,FALSE)),\"-\")","v":"-"},{"$f":"IFERROR(((C514-(VLOOKUP(E514,'Siatka płac'!$B$6:$E$17,3,FALSE)))/(VLOOKUP(E514,'Siatka płac'!$B$6:$E$17,4,FALSE)-VLOOKUP(E514,'Siatka płac'!$B$6:$E$17,3,FALSE))),\"-\")","v":"-"},"-",{"$f":"IF(G514=\"poniżej min.\",((VLOOKUP(E514,'Siatka płac'!$B$6:$D$17,3,FALSE)-C514)*(13-'Zestawienie stanowisk'!$H$1)),\"-\")","v":"-"}]
[0,null,null,null,{"$f":"IFERROR((VLOOKUP(B515,'Zestawienie stanowisk'!$B$5:$E$65,4,FALSE)),\"-\")","v":"-"},{"$f":"IFERROR(((C515-(VLOOKUP(E515,'Siatka płac'!$B$6:$E$17,3,FALSE)))/(VLOOKUP(E515,'Siatka płac'!$B$6:$E$17,4,FALSE)-VLOOKUP(E515,'Siatka płac'!$B$6:$E$17,3,FALSE))),\"-\")","v":"-"},"-",{"$f":"IF(G515=\"poniżej min.\",((VLOOKUP(E515,'Siatka płac'!$B$6:$D$17,3,FALSE)-C515)*(13-'Zestawienie stanowisk'!$H$1)),\"-\")","v":"-"}]
[0,null,null,null,{"$f":"IFERROR((VLOOKUP(B516,'Zestawienie stanowisk'!$B$5:$E$65,4,FALSE)),\"-\")","v":"-"},{"$f":"IFERROR(((C516-(VLOOKUP(E516,'Siatka płac'!$B$6:$E$17,3,FALSE)))/(VLOOKUP(E516,'Siatka płac'!$B$6:$E$17,4,FALSE)-VLOOKUP(E516,'Siatka płac'!$B$6:$E$17,3,FALSE))),\"-\")","v":"-"},"-",{"$f":"IF(G516=\"poniżej min.\",((VLOOKUP(E516,'Siatka płac'!$B$6:$D$17,3,FALSE)-C516)*(13-'Zestawienie stanowisk'!$H$1)),\"-\")","v":"-"}]
[{"$f":"IF(ISBLANK(B517),0,1)","v":0},null,null,null,{"$f":"IFERROR((VLOOKUP(B517,'Zestawienie stanowisk'!$B$5:$E$65,4,FALSE)),\"-\")","v":"-"},{"$f":"IFERROR(((C517-(VLOOKUP(E517,'Siatka płac'!$B$6:$E$17,3,FALSE)))/(VLOOKUP(E517,'Siatka płac'!$B$6:$E$17,4,FALSE)-VLOOKUP(E517,'Siatka płac'!$B$6:$E$17,3,FALSE))),\"-\")","v":"-"},{"$f":"IFERROR((INDEX($N$5:$N$10,MATCH(F517,$M$5:$M$10,-1))),\"-\")","v":"-"},{"$f":"IF(G517=\"poniżej min.\",((VLOOKUP(E517,'Siatka płac'!$B$6:$D$17,3,FALSE)-C517)*(13-'Zestawienie stanowisk'!$H$1)),\"-\")","v":"-"}]
[0,null,null,null,{"$f":"IFERROR((VLOOKUP(B518,'Zestawienie stanowisk'!$B$5:$E$65,4,FALSE)),\"-\")","v":"-"},{"$f":"IFERROR(((C518-(VLOOKUP(E518,'Siatka płac'!$B$6:$E$17,3,FALSE)))/(VLOOKUP(E518,'Siatka płac'!$B$6:$E$17,4,FALSE)-VLOOKUP(E518,'Siatka płac'!$B$6:$E$17,3,FALSE))),\"-\")","v":"-"},"-",{"$f":"IF(G518=\"poniżej min.\",((VLOOKUP(E518,'Siatka płac'!$B$6:$D$17,3,FALSE)-C518)*(13-'Zestawienie stanowisk'!$H$1)),\"-\")","v":"-"}]
[0,null,null,null,{"$f":"IFERROR((VLOOKUP(B519,'Zestawienie stanowisk'!$B$5:$E$65,4,FALSE)),\"-\")","v":"-"},{"$f":"IFERROR(((C519-(VLOOKUP(E519,'Siatka płac'!$B$6:$E$17,3,FALSE)))/(VLOOKUP(E519,'Siatka płac'!$B$6:$E$17,4,FALSE)-VLOOKUP(E519,'Siatka płac'!$B$6:$E$17,3,FALSE))),\"-\")","v":"-"},"-",{"$f":"IF(G519=\"poniżej min.\",((VLOOKUP(E519,'Siatka płac'!$B$6:$D$17,3,FALSE)-C519)*(13-'Zestawienie stanowisk'!$H$1)),\"-\")","v":"-"}]
[0,null,null,null,{"$f":"IFERROR((VLOOKUP(B520,'Zestawienie stanowisk'!$B$5:$E$65,4,FALSE)),\"-\")","v":"-"},{"$f":"IFERROR(((C520-(VLOOKUP(E520,'Siatka płac'!$B$6:$E$17,3,FALSE)))/(VLOOKUP(E520,'Siatka płac'!$B$6:$E$17,4,FALSE)-VLOOKUP(E520,'Siatka płac'!$B$6:$E$17,3,FALSE))),\"-\")","v":"-"},"-",{"$f":"IF(G520=\"poniżej min.\",((VLOOKUP(E520,'Siatka płac'!$B$6:$D$17,3,FALSE)-C520)*(13-'Zestawienie stanowisk'!$H$1)),\"-\")","v":"-"}]
[0,null,null,null,{"$f":"IFERROR((VLOOKUP(B521,'Zestawienie stanowisk'!$B$5:$E$65,4,FALSE)),\"-\")","v":"-"},{"$f":"IFERROR(((C521-(VLOOKUP(E521,'Siatka płac'!$B$6:$E$17,3,FALSE)))/(VLOOKUP(E521,'Siatka płac'!$B$6:$E$17,4,FALSE)-VLOOKUP(E521,'Siatka płac'!$B$6:$E$17,3,FALSE))),\"-\")","v":"-"},"-",{"$f":"IF(G521=\"poniżej min.\",((VLOOKUP(E521,'Siatka płac'!$B$6:$D$17,3,FALSE)-C521)*(13-'Zestawienie stanowisk'!$H$1)),\"-\")","v":"-"}]
[0,null,null,null,{"$f":"IFERROR((VLOOKUP(B522,'Zestawienie stanowisk'!$B$5:$E$65,4,FALSE)),\"-\")","v":"-"},{"$f":"IFERROR(((C522-(VLOOKUP(E522,'Siatka płac'!$B$6:$E$17,3,FALSE)))/(VLOOKUP(E522,'Siatka płac'!$B$6:$E$17,4,FALSE)-VLOOKUP(E522,'Siatka płac'!$B$6:$E$17,3,FALSE))),\"-\")","v":"-"},"-",{"$f":"IF(G522=\"poniżej min.\",((VLOOKUP(E522,'Siatka płac'!$B$6:$D$17,3,FALSE)-C522)*(13-'Zestawienie stanowisk'!$H$1)),\"-\")","v":"-"}]
[0,null,null,null,{"$f":"IFERROR((VLOOKUP(B523,'Zestawienie stanowisk'!$B$5:$E$65,4,FALSE)),\"-\")","v":"-"},{"$f":"IFERROR(((C523-(VLOOKUP(E523,'Siatka płac'!$B$6:$E$17,3,FALSE)))/(VLOOKUP(E523,'Siatka płac'!$B$6:$E$17,4,FALSE)-VLOOKUP(E523,'Siatka płac'!$B$6:$E$17,3,FALSE))),\"-\")","v":"-"},"-",{"$f":"IF(G523=\"poniżej min.\",((VLOOKUP(E523,'Siatka płac'!$B$6:$D$17,3,FALSE)-C523)*(13-'Zestawienie stanowisk'!$H$1)),\"-\")","v":"-"}]
[0,null,null,null,{"$f":"IFERROR((VLOOKUP(B524,'Zestawienie stanowisk'!$B$5:$E$65,4,FALSE)),\"-\")","v":"-"},{"$f":"IFERROR(((C524-(VLOOKUP(E524,'Siatka płac'!$B$6:$E$17,3,FALSE)))/(VLOOKUP(E524,'Siatka płac'!$B$6:$E$17,4,FALSE)-VLOOKUP(E524,'Siatka płac'!$B$6:$E$17,3,FALSE))),\"-\")","v":"-"},"-",{"$f":"IF(G524=\"poniżej min.\",((VLOOKUP(E524,'Siatka płac'!$B$6:$D$17,3,FALSE)-C524)*(13-'Zestawienie stanowisk'!$H$1)),\"-\")","v":"-"}]
[0,null,null,null,{"$f":"IFERROR((VLOOKUP(B525,'Zestawienie stanowisk'!$B$5:$E$65,4,FALSE)),\"-\")","v":"-"},{"$f":"IFERROR(((C525-(VLOOKUP(E525,'Siatka płac'!$B$6:$E$17,3,FALSE)))/(VLOOKUP(E525,'Siatka płac'!$B$6:$E$17,4,FALSE)-VLOOKUP(E525,'Siatka płac'!$B$6:$E$17,3,FALSE))),\"-\")","v":"-"},"-",{"$f":"IF(G525=\"poniżej min.\",((VLOOKUP(E525,'Siatka płac'!$B$6:$D$17,3,FALSE)-C525)*(13-'Zestawienie stanowisk'!$H$1)),\"-\")","v":"-"}]
[0,null,null,null,{"$f":"IFERROR((VLOOKUP(B526,'Zestawienie stanowisk'!$B$5:$E$65,4,FALSE)),\"-\")","v":"-"},{"$f":"IFERROR(((C526-(VLOOKUP(E526,'Siatka płac'!$B$6:$E$17,3,FALSE)))/(VLOOKUP(E526,'Siatka płac'!$B$6:$E$17,4,FALSE)-VLOOKUP(E526,'Siatka płac'!$B$6:$E$17,3,FALSE))),\"-\")","v":"-"},"-",{"$f":"IF(G526=\"poniżej min.\",((VLOOKUP(E526,'Siatka płac'!$B$6:$D$17,3,FALSE)-C526)*(13-'Zestawienie stanowisk'!$H$1)),\"-\")","v":"-"}]
[0,null,null,null,{"$f":"IFERROR((VLOOKUP(B527,'Zestawienie stanowisk'!$B$5:$E$65,4,FALSE)),\"-\")","v":"-"},{"$f":"IFERROR(((C527-(VLOOKUP(E527,'Siatka płac'!$B$6:$E$17,3,FALSE)))/(VLOOKUP(E527,'Siatka płac'!$B$6:$E$17,4,FALSE)-VLOOKUP(E527,'Siatka płac'!$B$6:$E$17,3,FALSE))),\"-\")","v":"-"},"-",{"$f":"IF(G527=\"poniżej min.\",((VLOOKUP(E527,'Siatka płac'!$B$6:$D$17,3,FALSE)-C527)*(13-'Zestawienie stanowisk'!$H$1)),\"-\")","v":"-"}]
[0,null,null,null,{"$f":"IFERROR((VLOOKUP(B528,'Zestawienie stanowisk'!$B$5:$E$65,4,FALSE)),\"-\")","v":"-"},{"$f":"IFERROR(((C528-(VLOOKUP(E528,'Siatka płac'!$B$6:$E$17,3,FALSE)))/(VLOOKUP(E528,'Siatka płac'!$B$6:$E$17,4,FALSE)-VLOOKUP(E528,'Siatka płac'!$B$6:$E$17,3,FALSE))),\"-\")","v":"-"},"-",{"$f":"IF(G528=\"poniżej min.\",((VLOOKUP(E528,'Siatka płac'!$B$6:$D$17,3,FALSE)-C528)*(13-'Zestawienie stanowisk'!$H$1)),\"-\")","v":"-"}]
[0,null,null,null,{"$f":"IFERROR((VLOOKUP(B529,'Zestawienie stanowisk'!$B$5:$E$65,4,FALSE)),\"-\")","v":"-"},{"$f":"IFERROR(((C529-(VLOOKUP(E529,'Siatka płac'!$B$6:$E$17,3,FALSE)))/(VLOOKUP(E529,'Siatka płac'!$B$6:$E$17,4,FALSE)-VLOOKUP(E529,'Siatka płac'!$B$6:$E$17,3,FALSE))),\"-\")","v":"-"},"-",{"$f":"IF(G529=\"poniżej min.\",((VLOOKUP(E529,'Siatka płac'!$B$6:$D$17,3,FALSE)-C529)*(13-'Zestawienie stanowisk'!$H$1)),\"-\")","v":"-"}]
[0,null,null,null,{"$f":"IFERROR((VLOOKUP(B530,'Zestawienie stanowisk'!$B$5:$E$65,4,FALSE)),\"-\")","v":"-"},{"$f":"IFERROR(((C530-(VLOOKUP(E530,'Siatka płac'!$B$6:$E$17,3,FALSE)))/(VLOOKUP(E530,'Siatka płac'!$B$6:$E$17,4,FALSE)-VLOOKUP(E530,'Siatka płac'!$B$6:$E$17,3,FALSE))),\"-\")","v":"-"},"-",{"$f":"IF(G530=\"poniżej min.\",((VLOOKUP(E530,'Siatka płac'!$B$6:$D$17,3,FALSE)-C530)*(13-'Zestawienie stanowisk'!$H$1)),\"-\")","v":"-"}]
[0,null,null,null,{"$f":"IFERROR((VLOOKUP(B531,'Zestawienie stanowisk'!$B$5:$E$65,4,FALSE)),\"-\")","v":"-"},{"$f":"IFERROR(((C531-(VLOOKUP(E531,'Siatka płac'!$B$6:$E$17,3,FALSE)))/(VLOOKUP(E531,'Siatka płac'!$B$6:$E$17,4,FALSE)-VLOOKUP(E531,'Siatka płac'!$B$6:$E$17,3,FALSE))),\"-\")","v":"-"},"-",{"$f":"IF(G531=\"poniżej min.\",((VLOOKUP(E531,'Siatka płac'!$B$6:$D$17,3,FALSE)-C531)*(13-'Zestawienie stanowisk'!$H$1)),\"-\")","v":"-"}]
[0,null,null,null,{"$f":"IFERROR((VLOOKUP(B532,'Zestawienie stanowisk'!$B$5:$E$65,4,FALSE)),\"-\")","v":"-"},{"$f":"IFERROR(((C532-(VLOOKUP(E532,'Siatka płac'!$B$6:$E$17,3,FALSE)))/(VLOOKUP(E532,'Siatka płac'!$B$6:$E$17,4,FALSE)-VLOOKUP(E532,'Siatka płac'!$B$6:$E$17,3,FALSE))),\"-\")","v":"-"},"-",{"$f":"IF(G532=\"poniżej min.\",((VLOOKUP(E532,'Siatka płac'!$B$6:$D$17,3,FALSE)-C532)*(13-'Zestawienie stanowisk'!$H$1)),\"-\")","v":"-"}]
[0,null,null,null,{"$f":"IFERROR((VLOOKUP(B533,'Zestawienie stanowisk'!$B$5:$E$65,4,FALSE)),\"-\")","v":"-"},{"$f":"IFERROR(((C533-(VLOOKUP(E533,'Siatka płac'!$B$6:$E$17,3,FALSE)))/(VLOOKUP(E533,'Siatka płac'!$B$6:$E$17,4,FALSE)-VLOOKUP(E533,'Siatka płac'!$B$6:$E$17,3,FALSE))),\"-\")","v":"-"},"-",{"$f":"IF(G533=\"poniżej min.\",((VLOOKUP(E533,'Siatka płac'!$B$6:$D$17,3,FALSE)-C533)*(13-'Zestawienie stanowisk'!$H$1)),\"-\")","v":"-"}]
[0,null,null,null,{"$f":"IFERROR((VLOOKUP(B534,'Zestawienie stanowisk'!$B$5:$E$65,4,FALSE)),\"-\")","v":"-"},{"$f":"IFERROR(((C534-(VLOOKUP(E534,'Siatka płac'!$B$6:$E$17,3,FALSE)))/(VLOOKUP(E534,'Siatka płac'!$B$6:$E$17,4,FALSE)-VLOOKUP(E534,'Siatka płac'!$B$6:$E$17,3,FALSE))),\"-\")","v":"-"},"-",{"$f":"IF(G534=\"poniżej min.\",((VLOOKUP(E534,'Siatka płac'!$B$6:$D$17,3,FALSE)-C534)*(13-'Zestawienie stanowisk'!$H$1)),\"-\")","v":"-"}]
[0,null,null,null,{"$f":"IFERROR((VLOOKUP(B535,'Zestawienie stanowisk'!$B$5:$E$65,4,FALSE)),\"-\")","v":"-"},{"$f":"IFERROR(((C535-(VLOOKUP(E535,'Siatka płac'!$B$6:$E$17,3,FALSE)))/(VLOOKUP(E535,'Siatka płac'!$B$6:$E$17,4,FALSE)-VLOOKUP(E535,'Siatka płac'!$B$6:$E$17,3,FALSE))),\"-\")","v":"-"},"-",{"$f":"IF(G535=\"poniżej min.\",((VLOOKUP(E535,'Siatka płac'!$B$6:$D$17,3,FALSE)-C535)*(13-'Zestawienie stanowisk'!$H$1)),\"-\")","v":"-"}]
[0,null,null,null,{"$f":"IFERROR((VLOOKUP(B536,'Zestawienie stanowisk'!$B$5:$E$65,4,FALSE)),\"-\")","v":"-"},{"$f":"IFERROR(((C536-(VLOOKUP(E536,'Siatka płac'!$B$6:$E$17,3,FALSE)))/(VLOOKUP(E536,'Siatka płac'!$B$6:$E$17,4,FALSE)-VLOOKUP(E536,'Siatka płac'!$B$6:$E$17,3,FALSE))),\"-\")","v":"-"},"-",{"$f":"IF(G536=\"poniżej min.\",((VLOOKUP(E536,'Siatka płac'!$B$6:$D$17,3,FALSE)-C536)*(13-'Zestawienie stanowisk'!$H$1)),\"-\")","v":"-"}]
[0,null,null,null,{"$f":"IFERROR((VLOOKUP(B537,'Zestawienie stanowisk'!$B$5:$E$65,4,FALSE)),\"-\")","v":"-"},{"$f":"IFERROR(((C537-(VLOOKUP(E537,'Siatka płac'!$B$6:$E$17,3,FALSE)))/(VLOOKUP(E537,'Siatka płac'!$B$6:$E$17,4,FALSE)-VLOOKUP(E537,'Siatka płac'!$B$6:$E$17,3,FALSE))),\"-\")","v":"-"},"-",{"$f":"IF(G537=\"poniżej min.\",((VLOOKUP(E537,'Siatka płac'!$B$6:$D$17,3,FALSE)-C537)*(13-'Zestawienie stanowisk'!$H$1)),\"-\")","v":"-"}]
[0,null,null,null,{"$f":"IFERROR((VLOOKUP(B538,'Zestawienie stanowisk'!$B$5:$E$65,4,FALSE)),\"-\")","v":"-"},{"$f":"IFERROR(((C538-(VLOOKUP(E538,'Siatka płac'!$B$6:$E$17,3,FALSE)))/(VLOOKUP(E538,'Siatka płac'!$B$6:$E$17,4,FALSE)-VLOOKUP(E538,'Siatka płac'!$B$6:$E$17,3,FALSE))),\"-\")","v":"-"},"-",{"$f":"IF(G538=\"poniżej min.\",((VLOOKUP(E538,'Siatka płac'!$B$6:$D$17,3,FALSE)-C538)*(13-'Zestawienie stanowisk'!$H$1)),\"-\")","v":"-"}]
[0,null,null,null,{"$f":"IFERROR((VLOOKUP(B539,'Zestawienie stanowisk'!$B$5:$E$65,4,FALSE)),\"-\")","v":"-"},{"$f":"IFERROR(((C539-(VLOOKUP(E539,'Siatka płac'!$B$6:$E$17,3,FALSE)))/(VLOOKUP(E539,'Siatka płac'!$B$6:$E$17,4,FALSE)-VLOOKUP(E539,'Siatka płac'!$B$6:$E$17,3,FALSE))),\"-\")","v":"-"},"-",{"$f":"IF(G539=\"poniżej min.\",((VLOOKUP(E539,'Siatka płac'!$B$6:$D$17,3,FALSE)-C539)*(13-'Zestawienie stanowisk'!$H$1)),\"-\")","v":"-"}]
[0,null,null,null,{"$f":"IFERROR((VLOOKUP(B540,'Zestawienie stanowisk'!$B$5:$E$65,4,FALSE)),\"-\")","v":"-"},{"$f":"IFERROR(((C540-(VLOOKUP(E540,'Siatka płac'!$B$6:$E$17,3,FALSE)))/(VLOOKUP(E540,'Siatka płac'!$B$6:$E$17,4,FALSE)-VLOOKUP(E540,'Siatka płac'!$B$6:$E$17,3,FALSE))),\"-\")","v":"-"},"-",{"$f":"IF(G540=\"poniżej min.\",((VLOOKUP(E540,'Siatka płac'!$B$6:$D$17,3,FALSE)-C540)*(13-'Zestawienie stanowisk'!$H$1)),\"-\")","v":"-"}]
[0,null,null,null,{"$f":"IFERROR((VLOOKUP(B541,'Zestawienie stanowisk'!$B$5:$E$65,4,FALSE)),\"-\")","v":"-"},{"$f":"IFERROR(((C541-(VLOOKUP(E541,'Siatka płac'!$B$6:$E$17,3,FALSE)))/(VLOOKUP(E541,'Siatka płac'!$B$6:$E$17,4,FALSE)-VLOOKUP(E541,'Siatka płac'!$B$6:$E$17,3,FALSE))),\"-\")","v":"-"},"-",{"$f":"IF(G541=\"poniżej min.\",((VLOOKUP(E541,'Siatka płac'!$B$6:$D$17,3,FALSE)-C541)*(13-'Zestawienie stanowisk'!$H$1)),\"-\")","v":"-"}]
[0,null,null,null,{"$f":"IFERROR((VLOOKUP(B542,'Zestawienie stanowisk'!$B$5:$E$65,4,FALSE)),\"-\")","v":"-"},{"$f":"IFERROR(((C542-(VLOOKUP(E542,'Siatka płac'!$B$6:$E$17,3,FALSE)))/(VLOOKUP(E542,'Siatka płac'!$B$6:$E$17,4,FALSE)-VLOOKUP(E542,'Siatka płac'!$B$6:$E$17,3,FALSE))),\"-\")","v":"-"},"-",{"$f":"IF(G542=\"poniżej min.\",((VLOOKUP(E542,'Siatka płac'!$B$6:$D$17,3,FALSE)-C542)*(13-'Zestawienie stanowisk'!$H$1)),\"-\")","v":"-"}]
[0,null,null,null,{"$f":"IFERROR((VLOOKUP(B543,'Zestawienie stanowisk'!$B$5:$E$65,4,FALSE)),\"-\")","v":"-"},{"$f":"IFERROR(((C543-(VLOOKUP(E543,'Siatka płac'!$B$6:$E$17,3,FALSE)))/(VLOOKUP(E543,'Siatka płac'!$B$6:$E$17,4,FALSE)-VLOOKUP(E543,'Siatka płac'!$B$6:$E$17,3,FALSE))),\"-\")","v":"-"},"-",{"$f":"IF(G543=\"poniżej min.\",((VLOOKUP(E543,'Siatka płac'!$B$6:$D$17,3,FALSE)-C543)*(13-'Zestawienie stanowisk'!$H$1)),\"-\")","v":"-"}]
[0,null,null,null,{"$f":"IFERROR((VLOOKUP(B544,'Zestawienie stanowisk'!$B$5:$E$65,4,FALSE)),\"-\")","v":"-"},{"$f":"IFERROR(((C544-(VLOOKUP(E544,'Siatka płac'!$B$6:$E$17,3,FALSE)))/(VLOOKUP(E544,'Siatka płac'!$B$6:$E$17,4,FALSE)-VLOOKUP(E544,'Siatka płac'!$B$6:$E$17,3,FALSE))),\"-\")","v":"-"},"-",{"$f":"IF(G544=\"poniżej min.\",((VLOOKUP(E544,'Siatka płac'!$B$6:$D$17,3,FALSE)-C544)*(13-'Zestawienie stanowisk'!$H$1)),\"-\")","v":"-"}]
[0,null,null,null,{"$f":"IFERROR((VLOOKUP(B545,'Zestawienie stanowisk'!$B$5:$E$65,4,FALSE)),\"-\")","v":"-"},{"$f":"IFERROR(((C545-(VLOOKUP(E545,'Siatka płac'!$B$6:$E$17,3,FALSE)))/(VLOOKUP(E545,'Siatka płac'!$B$6:$E$17,4,FALSE)-VLOOKUP(E545,'Siatka płac'!$B$6:$E$17,3,FALSE))),\"-\")","v":"-"},"-",{"$f":"IF(G545=\"poniżej min.\",((VLOOKUP(E545,'Siatka płac'!$B$6:$D$17,3,FALSE)-C545)*(13-'Zestawienie stanowisk'!$H$1)),\"-\")","v":"-"}]
[0,null,null,null,{"$f":"IFERROR((VLOOKUP(B546,'Zestawienie stanowisk'!$B$5:$E$65,4,FALSE)),\"-\")","v":"-"},{"$f":"IFERROR(((C546-(VLOOKUP(E546,'Siatka płac'!$B$6:$E$17,3,FALSE)))/(VLOOKUP(E546,'Siatka płac'!$B$6:$E$17,4,FALSE)-VLOOKUP(E546,'Siatka płac'!$B$6:$E$17,3,FALSE))),\"-\")","v":"-"},"-",{"$f":"IF(G546=\"poniżej min.\",((VLOOKUP(E546,'Siatka płac'!$B$6:$D$17,3,FALSE)-C546)*(13-'Zestawienie stanowisk'!$H$1)),\"-\")","v":"-"}]
[0,null,null,null,{"$f":"IFERROR((VLOOKUP(B547,'Zestawienie stanowisk'!$B$5:$E$65,4,FALSE)),\"-\")","v":"-"},{"$f":"IFERROR(((C547-(VLOOKUP(E547,'Siatka płac'!$B$6:$E$17,3,FALSE)))/(VLOOKUP(E547,'Siatka płac'!$B$6:$E$17,4,FALSE)-VLOOKUP(E547,'Siatka płac'!$B$6:$E$17,3,FALSE))),\"-\")","v":"-"},"-",{"$f":"IF(G547=\"poniżej min.\",((VLOOKUP(E547,'Siatka płac'!$B$6:$D$17,3,FALSE)-C547)*(13-'Zestawienie stanowisk'!$H$1)),\"-\")","v":"-"}]
[0,null,null,null,{"$f":"IFERROR((VLOOKUP(B548,'Zestawienie stanowisk'!$B$5:$E$65,4,FALSE)),\"-\")","v":"-"},{"$f":"IFERROR(((C548-(VLOOKUP(E548,'Siatka płac'!$B$6:$E$17,3,FALSE)))/(VLOOKUP(E548,'Siatka płac'!$B$6:$E$17,4,FALSE)-VLOOKUP(E548,'Siatka płac'!$B$6:$E$17,3,FALSE))),\"-\")","v":"-"},"-",{"$f":"IF(G548=\"poniżej min.\",((VLOOKUP(E548,'Siatka płac'!$B$6:$D$17,3,FALSE)-C548)*(13-'Zestawienie stanowisk'!$H$1)),\"-\")","v":"-"}]
[0,null,null,null,{"$f":"IFERROR((VLOOKUP(B549,'Zestawienie stanowisk'!$B$5:$E$65,4,FALSE)),\"-\")","v":"-"},{"$f":"IFERROR(((C549-(VLOOKUP(E549,'Siatka płac'!$B$6:$E$17,3,FALSE)))/(VLOOKUP(E549,'Siatka płac'!$B$6:$E$17,4,FALSE)-VLOOKUP(E549,'Siatka płac'!$B$6:$E$17,3,FALSE))),\"-\")","v":"-"},"-",{"$f":"IF(G549=\"poniżej min.\",((VLOOKUP(E549,'Siatka płac'!$B$6:$D$17,3,FALSE)-C549)*(13-'Zestawienie stanowisk'!$H$1)),\"-\")","v":"-"}]
[0,null,null,null,{"$f":"IFERROR((VLOOKUP(B550,'Zestawienie stanowisk'!$B$5:$E$65,4,FALSE)),\"-\")","v":"-"},{"$f":"IFERROR(((C550-(VLOOKUP(E550,'Siatka płac'!$B$6:$E$17,3,FALSE)))/(VLOOKUP(E550,'Siatka płac'!$B$6:$E$17,4,FALSE)-VLOOKUP(E550,'Siatka płac'!$B$6:$E$17,3,FALSE))),\"-\")","v":"-"},"-",{"$f":"IF(G550=\"poniżej min.\",((VLOOKUP(E550,'Siatka płac'!$B$6:$D$17,3,FALSE)-C550)*(13-'Zestawienie stanowisk'!$H$1)),\"-\")","v":"-"}]
[0,null,null,null,{"$f":"IFERROR((VLOOKUP(B551,'Zestawienie stanowisk'!$B$5:$E$65,4,FALSE)),\"-\")","v":"-"},{"$f":"IFERROR(((C551-(VLOOKUP(E551,'Siatka płac'!$B$6:$E$17,3,FALSE)))/(VLOOKUP(E551,'Siatka płac'!$B$6:$E$17,4,FALSE)-VLOOKUP(E551,'Siatka płac'!$B$6:$E$17,3,FALSE))),\"-\")","v":"-"},"-",{"$f":"IF(G551=\"poniżej min.\",((VLOOKUP(E551,'Siatka płac'!$B$6:$D$17,3,FALSE)-C551)*(13-'Zestawienie stanowisk'!$H$1)),\"-\")","v":"-"}]
[0,null,null,null,{"$f":"IFERROR((VLOOKUP(B552,'Zestawienie stanowisk'!$B$5:$E$65,4,FALSE)),\"-\")","v":"-"},{"$f":"IFERROR(((C552-(VLOOKUP(E552,'Siatka płac'!$B$6:$E$17,3,FALSE)))/(VLOOKUP(E552,'Siatka płac'!$B$6:$E$17,4,FALSE)-VLOOKUP(E552,'Siatka płac'!$B$6:$E$17,3,FALSE))),\"-\")","v":"-"},"-",{"$f":"IF(G552=\"poniżej min.\",((VLOOKUP(E552,'Siatka płac'!$B$6:$D$17,3,FALSE)-C552)*(13-'Zestawienie stanowisk'!$H$1)),\"-\")","v":"-"}]
[0,null,null,null,{"$f":"IFERROR((VLOOKUP(B553,'Zestawienie stanowisk'!$B$5:$E$65,4,FALSE)),\"-\")","v":"-"},{"$f":"IFERROR(((C553-(VLOOKUP(E553,'Siatka płac'!$B$6:$E$17,3,FALSE)))/(VLOOKUP(E553,'Siatka płac'!$B$6:$E$17,4,FALSE)-VLOOKUP(E553,'Siatka płac'!$B$6:$E$17,3,FALSE))),\"-\")","v":"-"},"-",{"$f":"IF(G553=\"poniżej min.\",((VLOOKUP(E553,'Siatka płac'!$B$6:$D$17,3,FALSE)-C553)*(13-'Zestawienie stanowisk'!$H$1)),\"-\")","v":"-"}]
[0,null,null,null,{"$f":"IFERROR((VLOOKUP(B554,'Zestawienie stanowisk'!$B$5:$E$65,4,FALSE)),\"-\")","v":"-"},{"$f":"IFERROR(((C554-(VLOOKUP(E554,'Siatka płac'!$B$6:$E$17,3,FALSE)))/(VLOOKUP(E554,'Siatka płac'!$B$6:$E$17,4,FALSE)-VLOOKUP(E554,'Siatka płac'!$B$6:$E$17,3,FALSE))),\"-\")","v":"-"},"-",{"$f":"IF(G554=\"poniżej min.\",((VLOOKUP(E554,'Siatka płac'!$B$6:$D$17,3,FALSE)-C554)*(13-'Zestawienie stanowisk'!$H$1)),\"-\")","v":"-"}]
[0,null,null,null,{"$f":"IFERROR((VLOOKUP(B555,'Zestawienie stanowisk'!$B$5:$E$65,4,FALSE)),\"-\")","v":"-"},{"$f":"IFERROR(((C555-(VLOOKUP(E555,'Siatka płac'!$B$6:$E$17,3,FALSE)))/(VLOOKUP(E555,'Siatka płac'!$B$6:$E$17,4,FALSE)-VLOOKUP(E555,'Siatka płac'!$B$6:$E$17,3,FALSE))),\"-\")","v":"-"},"-",{"$f":"IF(G555=\"poniżej min.\",((VLOOKUP(E555,'Siatka płac'!$B$6:$D$17,3,FALSE)-C555)*(13-'Zestawienie stanowisk'!$H$1)),\"-\")","v":"-"}]
[0,null,null,null,{"$f":"IFERROR((VLOOKUP(B556,'Zestawienie stanowisk'!$B$5:$E$65,4,FALSE)),\"-\")","v":"-"},{"$f":"IFERROR(((C556-(VLOOKUP(E556,'Siatka płac'!$B$6:$E$17,3,FALSE)))/(VLOOKUP(E556,'Siatka płac'!$B$6:$E$17,4,FALSE)-VLOOKUP(E556,'Siatka płac'!$B$6:$E$17,3,FALSE))),\"-\")","v":"-"},"-",{"$f":"IF(G556=\"poniżej min.\",((VLOOKUP(E556,'Siatka płac'!$B$6:$D$17,3,FALSE)-C556)*(13-'Zestawienie stanowisk'!$H$1)),\"-\")","v":"-"}]
[0,null,null,null,{"$f":"IFERROR((VLOOKUP(B557,'Zestawienie stanowisk'!$B$5:$E$65,4,FALSE)),\"-\")","v":"-"},{"$f":"IFERROR(((C557-(VLOOKUP(E557,'Siatka płac'!$B$6:$E$17,3,FALSE)))/(VLOOKUP(E557,'Siatka płac'!$B$6:$E$17,4,FALSE)-VLOOKUP(E557,'Siatka płac'!$B$6:$E$17,3,FALSE))),\"-\")","v":"-"},"-",{"$f":"IF(G557=\"poniżej min.\",((VLOOKUP(E557,'Siatka płac'!$B$6:$D$17,3,FALSE)-C557)*(13-'Zestawienie stanowisk'!$H$1)),\"-\")","v":"-"}]
[0,null,null,null,{"$f":"IFERROR((VLOOKUP(B558,'Zestawienie stanowisk'!$B$5:$E$65,4,FALSE)),\"-\")","v":"-"},{"$f":"IFERROR(((C558-(VLOOKUP(E558,'Siatka płac'!$B$6:$E$17,3,FALSE)))/(VLOOKUP(E558,'Siatka płac'!$B$6:$E$17,4,FALSE)-VLOOKUP(E558,'Siatka płac'!$B$6:$E$17,3,FALSE))),\"-\")","v":"-"},"-",{"$f":"IF(G558=\"poniżej min.\",((VLOOKUP(E558,'Siatka płac'!$B$6:$D$17,3,FALSE)-C558)*(13-'Zestawienie stanowisk'!$H$1)),\"-\")","v":"-"}]
[0,null,null,null,{"$f":"IFERROR((VLOOKUP(B559,'Zestawienie stanowisk'!$B$5:$E$65,4,FALSE)),\"-\")","v":"-"},{"$f":"IFERROR(((C559-(VLOOKUP(E559,'Siatka płac'!$B$6:$E$17,3,FALSE)))/(VLOOKUP(E559,'Siatka płac'!$B$6:$E$17,4,FALSE)-VLOOKUP(E559,'Siatka płac'!$B$6:$E$17,3,FALSE))),\"-\")","v":"-"},"-",{"$f":"IF(G559=\"poniżej min.\",((VLOOKUP(E559,'Siatka płac'!$B$6:$D$17,3,FALSE)-C559)*(13-'Zestawienie stanowisk'!$H$1)),\"-\")","v":"-"}]
[0,null,null,null,{"$f":"IFERROR((VLOOKUP(B560,'Zestawienie stanowisk'!$B$5:$E$65,4,FALSE)),\"-\")","v":"-"},{"$f":"IFERROR(((C560-(VLOOKUP(E560,'Siatka płac'!$B$6:$E$17,3,FALSE)))/(VLOOKUP(E560,'Siatka płac'!$B$6:$E$17,4,FALSE)-VLOOKUP(E560,'Siatka płac'!$B$6:$E$17,3,FALSE))),\"-\")","v":"-"},"-",{"$f":"IF(G560=\"poniżej min.\",((VLOOKUP(E560,'Siatka płac'!$B$6:$D$17,3,FALSE)-C560)*(13-'Zestawienie stanowisk'!$H$1)),\"-\")","v":"-"}]
[0,null,null,null,{"$f":"IFERROR((VLOOKUP(B561,'Zestawienie stanowisk'!$B$5:$E$65,4,FALSE)),\"-\")","v":"-"},{"$f":"IFERROR(((C561-(VLOOKUP(E561,'Siatka płac'!$B$6:$E$17,3,FALSE)))/(VLOOKUP(E561,'Siatka płac'!$B$6:$E$17,4,FALSE)-VLOOKUP(E561,'Siatka płac'!$B$6:$E$17,3,FALSE))),\"-\")","v":"-"},"-",{"$f":"IF(G561=\"poniżej min.\",((VLOOKUP(E561,'Siatka płac'!$B$6:$D$17,3,FALSE)-C561)*(13-'Zestawienie stanowisk'!$H$1)),\"-\")","v":"-"}]
[0,null,null,null,{"$f":"IFERROR((VLOOKUP(B562,'Zestawienie stanowisk'!$B$5:$E$65,4,FALSE)),\"-\")","v":"-"},{"$f":"IFERROR(((C562-(VLOOKUP(E562,'Siatka płac'!$B$6:$E$17,3,FALSE)))/(VLOOKUP(E562,'Siatka płac'!$B$6:$E$17,4,FALSE)-VLOOKUP(E562,'Siatka płac'!$B$6:$E$17,3,FALSE))),\"-\")","v":"-"},"-",{"$f":"IF(G562=\"poniżej min.\",((VLOOKUP(E562,'Siatka płac'!$B$6:$D$17,3,FALSE)-C562)*(13-'Zestawienie stanowisk'!$H$1)),\"-\")","v":"-"}]
[0,null,null,null,{"$f":"IFERROR((VLOOKUP(B563,'Zestawienie stanowisk'!$B$5:$E$65,4,FALSE)),\"-\")","v":"-"},{"$f":"IFERROR(((C563-(VLOOKUP(E563,'Siatka płac'!$B$6:$E$17,3,FALSE)))/(VLOOKUP(E563,'Siatka płac'!$B$6:$E$17,4,FALSE)-VLOOKUP(E563,'Siatka płac'!$B$6:$E$17,3,FALSE))),\"-\")","v":"-"},"-",{"$f":"IF(G563=\"poniżej min.\",((VLOOKUP(E563,'Siatka płac'!$B$6:$D$17,3,FALSE)-C563)*(13-'Zestawienie stanowisk'!$H$1)),\"-\")","v":"-"}]
[0,null,null,null,{"$f":"IFERROR((VLOOKUP(B564,'Zestawienie stanowisk'!$B$5:$E$65,4,FALSE)),\"-\")","v":"-"},{"$f":"IFERROR(((C564-(VLOOKUP(E564,'Siatka płac'!$B$6:$E$17,3,FALSE)))/(VLOOKUP(E564,'Siatka płac'!$B$6:$E$17,4,FALSE)-VLOOKUP(E564,'Siatka płac'!$B$6:$E$17,3,FALSE))),\"-\")","v":"-"},"-",{"$f":"IF(G564=\"poniżej min.\",((VLOOKUP(E564,'Siatka płac'!$B$6:$D$17,3,FALSE)-C564)*(13-'Zestawienie stanowisk'!$H$1)),\"-\")","v":"-"}]
[0,null,null,null,{"$f":"IFERROR((VLOOKUP(B565,'Zestawienie stanowisk'!$B$5:$E$65,4,FALSE)),\"-\")","v":"-"},{"$f":"IFERROR(((C565-(VLOOKUP(E565,'Siatka płac'!$B$6:$E$17,3,FALSE)))/(VLOOKUP(E565,'Siatka płac'!$B$6:$E$17,4,FALSE)-VLOOKUP(E565,'Siatka płac'!$B$6:$E$17,3,FALSE))),\"-\")","v":"-"},"-",{"$f":"IF(G565=\"poniżej min.\",((VLOOKUP(E565,'Siatka płac'!$B$6:$D$17,3,FALSE)-C565)*(13-'Zestawienie stanowisk'!$H$1)),\"-\")","v":"-"}]
[0,null,null,null,{"$f":"IFERROR((VLOOKUP(B566,'Zestawienie stanowisk'!$B$5:$E$65,4,FALSE)),\"-\")","v":"-"},{"$f":"IFERROR(((C566-(VLOOKUP(E566,'Siatka płac'!$B$6:$E$17,3,FALSE)))/(VLOOKUP(E566,'Siatka płac'!$B$6:$E$17,4,FALSE)-VLOOKUP(E566,'Siatka płac'!$B$6:$E$17,3,FALSE))),\"-\")","v":"-"},"-",{"$f":"IF(G566=\"poniżej min.\",((VLOOKUP(E566,'Siatka płac'!$B$6:$D$17,3,FALSE)-C566)*(13-'Zestawienie stanowisk'!$H$1)),\"-\")","v":"-"}]
[0,null,null,null,{"$f":"IFERROR((VLOOKUP(B567,'Zestawienie stanowisk'!$B$5:$E$65,4,FALSE)),\"-\")","v":"-"},{"$f":"IFERROR(((C567-(VLOOKUP(E567,'Siatka płac'!$B$6:$E$17,3,FALSE)))/(VLOOKUP(E567,'Siatka płac'!$B$6:$E$17,4,FALSE)-VLOOKUP(E567,'Siatka płac'!$B$6:$E$17,3,FALSE))),\"-\")","v":"-"},"-",{"$f":"IF(G567=\"poniżej min.\",((VLOOKUP(E567,'Siatka płac'!$B$6:$D$17,3,FALSE)-C567)*(13-'Zestawienie stanowisk'!$H$1)),\"-\")","v":"-"}]
[0,null,null,null,{"$f":"IFERROR((VLOOKUP(B568,'Zestawienie stanowisk'!$B$5:$E$65,4,FALSE)),\"-\")","v":"-"},{"$f":"IFERROR(((C568-(VLOOKUP(E568,'Siatka płac'!$B$6:$E$17,3,FALSE)))/(VLOOKUP(E568,'Siatka płac'!$B$6:$E$17,4,FALSE)-VLOOKUP(E568,'Siatka płac'!$B$6:$E$17,3,FALSE))),\"-\")","v":"-"},"-",{"$f":"IF(G568=\"poniżej min.\",((VLOOKUP(E568,'Siatka płac'!$B$6:$D$17,3,FALSE)-C568)*(13-'Zestawienie stanowisk'!$H$1)),\"-\")","v":"-"}]
[0,null,null,null,{"$f":"IFERROR((VLOOKUP(B569,'Zestawienie stanowisk'!$B$5:$E$65,4,FALSE)),\"-\")","v":"-"},{"$f":"IFERROR(((C569-(VLOOKUP(E569,'Siatka płac'!$B$6:$E$17,3,FALSE)))/(VLOOKUP(E569,'Siatka płac'!$B$6:$E$17,4,FALSE)-VLOOKUP(E569,'Siatka płac'!$B$6:$E$17,3,FALSE))),\"-\")","v":"-"},"-",{"$f":"IF(G569=\"poniżej min.\",((VLOOKUP(E569,'Siatka płac'!$B$6:$D$17,3,FALSE)-C569)*(13-'Zestawienie stanowisk'!$H$1)),\"-\")","v":"-"}]
[0,null,null,null,{"$f":"IFERROR((VLOOKUP(B570,'Zestawienie stanowisk'!$B$5:$E$65,4,FALSE)),\"-\")","v":"-"},{"$f":"IFERROR(((C570-(VLOOKUP(E570,'Siatka płac'!$B$6:$E$17,3,FALSE)))/(VLOOKUP(E570,'Siatka płac'!$B$6:$E$17,4,FALSE)-VLOOKUP(E570,'Siatka płac'!$B$6:$E$17,3,FALSE))),\"-\")","v":"-"},"-",{"$f":"IF(G570=\"poniżej min.\",((VLOOKUP(E570,'Siatka płac'!$B$6:$D$17,3,FALSE)-C570)*(13-'Zestawienie stanowisk'!$H$1)),\"-\")","v":"-"}]
[0,null,null,null,{"$f":"IFERROR((VLOOKUP(B571,'Zestawienie stanowisk'!$B$5:$E$65,4,FALSE)),\"-\")","v":"-"},{"$f":"IFERROR(((C571-(VLOOKUP(E571,'Siatka płac'!$B$6:$E$17,3,FALSE)))/(VLOOKUP(E571,'Siatka płac'!$B$6:$E$17,4,FALSE)-VLOOKUP(E571,'Siatka płac'!$B$6:$E$17,3,FALSE))),\"-\")","v":"-"},"-",{"$f":"IF(G571=\"poniżej min.\",((VLOOKUP(E571,'Siatka płac'!$B$6:$D$17,3,FALSE)-C571)*(13-'Zestawienie stanowisk'!$H$1)),\"-\")","v":"-"}]
[0,null,null,null,{"$f":"IFERROR((VLOOKUP(B572,'Zestawienie stanowisk'!$B$5:$E$65,4,FALSE)),\"-\")","v":"-"},{"$f":"IFERROR(((C572-(VLOOKUP(E572,'Siatka płac'!$B$6:$E$17,3,FALSE)))/(VLOOKUP(E572,'Siatka płac'!$B$6:$E$17,4,FALSE)-VLOOKUP(E572,'Siatka płac'!$B$6:$E$17,3,FALSE))),\"-\")","v":"-"},"-",{"$f":"IF(G572=\"poniżej min.\",((VLOOKUP(E572,'Siatka płac'!$B$6:$D$17,3,FALSE)-C572)*(13-'Zestawienie stanowisk'!$H$1)),\"-\")","v":"-"}]
[0,null,null,null,{"$f":"IFERROR((VLOOKUP(B573,'Zestawienie stanowisk'!$B$5:$E$65,4,FALSE)),\"-\")","v":"-"},{"$f":"IFERROR(((C573-(VLOOKUP(E573,'Siatka płac'!$B$6:$E$17,3,FALSE)))/(VLOOKUP(E573,'Siatka płac'!$B$6:$E$17,4,FALSE)-VLOOKUP(E573,'Siatka płac'!$B$6:$E$17,3,FALSE))),\"-\")","v":"-"},"-",{"$f":"IF(G573=\"poniżej min.\",((VLOOKUP(E573,'Siatka płac'!$B$6:$D$17,3,FALSE)-C573)*(13-'Zestawienie stanowisk'!$H$1)),\"-\")","v":"-"}]
[0,null,null,null,{"$f":"IFERROR((VLOOKUP(B574,'Zestawienie stanowisk'!$B$5:$E$65,4,FALSE)),\"-\")","v":"-"},{"$f":"IFERROR(((C574-(VLOOKUP(E574,'Siatka płac'!$B$6:$E$17,3,FALSE)))/(VLOOKUP(E574,'Siatka płac'!$B$6:$E$17,4,FALSE)-VLOOKUP(E574,'Siatka płac'!$B$6:$E$17,3,FALSE))),\"-\")","v":"-"},"-",{"$f":"IF(G574=\"poniżej min.\",((VLOOKUP(E574,'Siatka płac'!$B$6:$D$17,3,FALSE)-C574)*(13-'Zestawienie stanowisk'!$H$1)),\"-\")","v":"-"}]
[0,null,null,null,{"$f":"IFERROR((VLOOKUP(B575,'Zestawienie stanowisk'!$B$5:$E$65,4,FALSE)),\"-\")","v":"-"},{"$f":"IFERROR(((C575-(VLOOKUP(E575,'Siatka płac'!$B$6:$E$17,3,FALSE)))/(VLOOKUP(E575,'Siatka płac'!$B$6:$E$17,4,FALSE)-VLOOKUP(E575,'Siatka płac'!$B$6:$E$17,3,FALSE))),\"-\")","v":"-"},"-",{"$f":"IF(G575=\"poniżej min.\",((VLOOKUP(E575,'Siatka płac'!$B$6:$D$17,3,FALSE)-C575)*(13-'Zestawienie stanowisk'!$H$1)),\"-\")","v":"-"}]
[0,null,null,null,{"$f":"IFERROR((VLOOKUP(B576,'Zestawienie stanowisk'!$B$5:$E$65,4,FALSE)),\"-\")","v":"-"},{"$f":"IFERROR(((C576-(VLOOKUP(E576,'Siatka płac'!$B$6:$E$17,3,FALSE)))/(VLOOKUP(E576,'Siatka płac'!$B$6:$E$17,4,FALSE)-VLOOKUP(E576,'Siatka płac'!$B$6:$E$17,3,FALSE))),\"-\")","v":"-"},"-",{"$f":"IF(G576=\"poniżej min.\",((VLOOKUP(E576,'Siatka płac'!$B$6:$D$17,3,FALSE)-C576)*(13-'Zestawienie stanowisk'!$H$1)),\"-\")","v":"-"}]
[0,null,null,null,{"$f":"IFERROR((VLOOKUP(B577,'Zestawienie stanowisk'!$B$5:$E$65,4,FALSE)),\"-\")","v":"-"},{"$f":"IFERROR(((C577-(VLOOKUP(E577,'Siatka płac'!$B$6:$E$17,3,FALSE)))/(VLOOKUP(E577,'Siatka płac'!$B$6:$E$17,4,FALSE)-VLOOKUP(E577,'Siatka płac'!$B$6:$E$17,3,FALSE))),\"-\")","v":"-"},"-",{"$f":"IF(G577=\"poniżej min.\",((VLOOKUP(E577,'Siatka płac'!$B$6:$D$17,3,FALSE)-C577)*(13-'Zestawienie stanowisk'!$H$1)),\"-\")","v":"-"}]
[0,null,null,null,{"$f":"IFERROR((VLOOKUP(B578,'Zestawienie stanowisk'!$B$5:$E$65,4,FALSE)),\"-\")","v":"-"},{"$f":"IFERROR(((C578-(VLOOKUP(E578,'Siatka płac'!$B$6:$E$17,3,FALSE)))/(VLOOKUP(E578,'Siatka płac'!$B$6:$E$17,4,FALSE)-VLOOKUP(E578,'Siatka płac'!$B$6:$E$17,3,FALSE))),\"-\")","v":"-"},"-",{"$f":"IF(G578=\"poniżej min.\",((VLOOKUP(E578,'Siatka płac'!$B$6:$D$17,3,FALSE)-C578)*(13-'Zestawienie stanowisk'!$H$1)),\"-\")","v":"-"}]
[0,null,null,null,{"$f":"IFERROR((VLOOKUP(B579,'Zestawienie stanowisk'!$B$5:$E$65,4,FALSE)),\"-\")","v":"-"},{"$f":"IFERROR(((C579-(VLOOKUP(E579,'Siatka płac'!$B$6:$E$17,3,FALSE)))/(VLOOKUP(E579,'Siatka płac'!$B$6:$E$17,4,FALSE)-VLOOKUP(E579,'Siatka płac'!$B$6:$E$17,3,FALSE))),\"-\")","v":"-"},"-",{"$f":"IF(G579=\"poniżej min.\",((VLOOKUP(E579,'Siatka płac'!$B$6:$D$17,3,FALSE)-C579)*(13-'Zestawienie stanowisk'!$H$1)),\"-\")","v":"-"}]
[0,null,null,null,{"$f":"IFERROR((VLOOKUP(B580,'Zestawienie stanowisk'!$B$5:$E$65,4,FALSE)),\"-\")","v":"-"},{"$f":"IFERROR(((C580-(VLOOKUP(E580,'Siatka płac'!$B$6:$E$17,3,FALSE)))/(VLOOKUP(E580,'Siatka płac'!$B$6:$E$17,4,FALSE)-VLOOKUP(E580,'Siatka płac'!$B$6:$E$17,3,FALSE))),\"-\")","v":"-"},"-",{"$f":"IF(G580=\"poniżej min.\",((VLOOKUP(E580,'Siatka płac'!$B$6:$D$17,3,FALSE)-C580)*(13-'Zestawienie stanowisk'!$H$1)),\"-\")","v":"-"}]
[{"$f":"IF(ISBLANK(B581),0,1)","v":0},null,null,null,{"$f":"IFERROR((VLOOKUP(B581,'Zestawienie stanowisk'!$B$5:$E$65,4,FALSE)),\"-\")","v":"-"},{"$f":"IFERROR(((C581-(VLOOKUP(E581,'Siatka płac'!$B$6:$E$17,3,FALSE)))/(VLOOKUP(E581,'Siatka płac'!$B$6:$E$17,4,FALSE)-VLOOKUP(E581,'Siatka płac'!$B$6:$E$17,3,FALSE))),\"-\")","v":"-"},{"$f":"IFERROR((INDEX($N$5:$N$10,MATCH(F581,$M$5:$M$10,-1))),\"-\")","v":"-"},{"$f":"IF(G581=\"poniżej min.\",((VLOOKUP(E581,'Siatka płac'!$B$6:$D$17,3,FALSE)-C581)*(13-'Zestawienie stanowisk'!$H$1)),\"-\")","v":"-"}]
[0,null,null,null,{"$f":"IFERROR((VLOOKUP(B582,'Zestawienie stanowisk'!$B$5:$E$65,4,FALSE)),\"-\")","v":"-"},{"$f":"IFERROR(((C582-(VLOOKUP(E582,'Siatka płac'!$B$6:$E$17,3,FALSE)))/(VLOOKUP(E582,'Siatka płac'!$B$6:$E$17,4,FALSE)-VLOOKUP(E582,'Siatka płac'!$B$6:$E$17,3,FALSE))),\"-\")","v":"-"},"-",{"$f":"IF(G582=\"poniżej min.\",((VLOOKUP(E582,'Siatka płac'!$B$6:$D$17,3,FALSE)-C582)*(13-'Zestawienie stanowisk'!$H$1)),\"-\")","v":"-"}]
[0,null,null,null,{"$f":"IFERROR((VLOOKUP(B583,'Zestawienie stanowisk'!$B$5:$E$65,4,FALSE)),\"-\")","v":"-"},{"$f":"IFERROR(((C583-(VLOOKUP(E583,'Siatka płac'!$B$6:$E$17,3,FALSE)))/(VLOOKUP(E583,'Siatka płac'!$B$6:$E$17,4,FALSE)-VLOOKUP(E583,'Siatka płac'!$B$6:$E$17,3,FALSE))),\"-\")","v":"-"},"-",{"$f":"IF(G583=\"poniżej min.\",((VLOOKUP(E583,'Siatka płac'!$B$6:$D$17,3,FALSE)-C583)*(13-'Zestawienie stanowisk'!$H$1)),\"-\")","v":"-"}]
[0,null,null,null,{"$f":"IFERROR((VLOOKUP(B584,'Zestawienie stanowisk'!$B$5:$E$65,4,FALSE)),\"-\")","v":"-"},{"$f":"IFERROR(((C584-(VLOOKUP(E584,'Siatka płac'!$B$6:$E$17,3,FALSE)))/(VLOOKUP(E584,'Siatka płac'!$B$6:$E$17,4,FALSE)-VLOOKUP(E584,'Siatka płac'!$B$6:$E$17,3,FALSE))),\"-\")","v":"-"},"-",{"$f":"IF(G584=\"poniżej min.\",((VLOOKUP(E584,'Siatka płac'!$B$6:$D$17,3,FALSE)-C584)*(13-'Zestawienie stanowisk'!$H$1)),\"-\")","v":"-"}]
[0,null,null,null,{"$f":"IFERROR((VLOOKUP(B585,'Zestawienie stanowisk'!$B$5:$E$65,4,FALSE)),\"-\")","v":"-"},{"$f":"IFERROR(((C585-(VLOOKUP(E585,'Siatka płac'!$B$6:$E$17,3,FALSE)))/(VLOOKUP(E585,'Siatka płac'!$B$6:$E$17,4,FALSE)-VLOOKUP(E585,'Siatka płac'!$B$6:$E$17,3,FALSE))),\"-\")","v":"-"},"-",{"$f":"IF(G585=\"poniżej min.\",((VLOOKUP(E585,'Siatka płac'!$B$6:$D$17,3,FALSE)-C585)*(13-'Zestawienie stanowisk'!$H$1)),\"-\")","v":"-"}]
[0,null,null,null,{"$f":"IFERROR((VLOOKUP(B586,'Zestawienie stanowisk'!$B$5:$E$65,4,FALSE)),\"-\")","v":"-"},{"$f":"IFERROR(((C586-(VLOOKUP(E586,'Siatka płac'!$B$6:$E$17,3,FALSE)))/(VLOOKUP(E586,'Siatka płac'!$B$6:$E$17,4,FALSE)-VLOOKUP(E586,'Siatka płac'!$B$6:$E$17,3,FALSE))),\"-\")","v":"-"},"-",{"$f":"IF(G586=\"poniżej min.\",((VLOOKUP(E586,'Siatka płac'!$B$6:$D$17,3,FALSE)-C586)*(13-'Zestawienie stanowisk'!$H$1)),\"-\")","v":"-"}]
[0,null,null,null,{"$f":"IFERROR((VLOOKUP(B587,'Zestawienie stanowisk'!$B$5:$E$65,4,FALSE)),\"-\")","v":"-"},{"$f":"IFERROR(((C587-(VLOOKUP(E587,'Siatka płac'!$B$6:$E$17,3,FALSE)))/(VLOOKUP(E587,'Siatka płac'!$B$6:$E$17,4,FALSE)-VLOOKUP(E587,'Siatka płac'!$B$6:$E$17,3,FALSE))),\"-\")","v":"-"},"-",{"$f":"IF(G587=\"poniżej min.\",((VLOOKUP(E587,'Siatka płac'!$B$6:$D$17,3,FALSE)-C587)*(13-'Zestawienie stanowisk'!$H$1)),\"-\")","v":"-"}]
[0,null,null,null,{"$f":"IFERROR((VLOOKUP(B588,'Zestawienie stanowisk'!$B$5:$E$65,4,FALSE)),\"-\")","v":"-"},{"$f":"IFERROR(((C588-(VLOOKUP(E588,'Siatka płac'!$B$6:$E$17,3,FALSE)))/(VLOOKUP(E588,'Siatka płac'!$B$6:$E$17,4,FALSE)-VLOOKUP(E588,'Siatka płac'!$B$6:$E$17,3,FALSE))),\"-\")","v":"-"},"-",{"$f":"IF(G588=\"poniżej min.\",((VLOOKUP(E588,'Siatka płac'!$B$6:$D$17,3,FALSE)-C588)*(13-'Zestawienie stanowisk'!$H$1)),\"-\")","v":"-"}]
[0,null,null,null,{"$f":"IFERROR((VLOOKUP(B589,'Zestawienie stanowisk'!$B$5:$E$65,4,FALSE)),\"-\")","v":"-"},{"$f":"IFERROR(((C589-(VLOOKUP(E589,'Siatka płac'!$B$6:$E$17,3,FALSE)))/(VLOOKUP(E589,'Siatka płac'!$B$6:$E$17,4,FALSE)-VLOOKUP(E589,'Siatka płac'!$B$6:$E$17,3,FALSE))),\"-\")","v":"-"},"-",{"$f":"IF(G589=\"poniżej min.\",((VLOOKUP(E589,'Siatka płac'!$B$6:$D$17,3,FALSE)-C589)*(13-'Zestawienie stanowisk'!$H$1)),\"-\")","v":"-"}]
[0,null,null,null,{"$f":"IFERROR((VLOOKUP(B590,'Zestawienie stanowisk'!$B$5:$E$65,4,FALSE)),\"-\")","v":"-"},{"$f":"IFERROR(((C590-(VLOOKUP(E590,'Siatka płac'!$B$6:$E$17,3,FALSE)))/(VLOOKUP(E590,'Siatka płac'!$B$6:$E$17,4,FALSE)-VLOOKUP(E590,'Siatka płac'!$B$6:$E$17,3,FALSE))),\"-\")","v":"-"},"-",{"$f":"IF(G590=\"poniżej min.\",((VLOOKUP(E590,'Siatka płac'!$B$6:$D$17,3,FALSE)-C590)*(13-'Zestawienie stanowisk'!$H$1)),\"-\")","v":"-"}]
[0,null,null,null,{"$f":"IFERROR((VLOOKUP(B591,'Zestawienie stanowisk'!$B$5:$E$65,4,FALSE)),\"-\")","v":"-"},{"$f":"IFERROR(((C591-(VLOOKUP(E591,'Siatka płac'!$B$6:$E$17,3,FALSE)))/(VLOOKUP(E591,'Siatka płac'!$B$6:$E$17,4,FALSE)-VLOOKUP(E591,'Siatka płac'!$B$6:$E$17,3,FALSE))),\"-\")","v":"-"},"-",{"$f":"IF(G591=\"poniżej min.\",((VLOOKUP(E591,'Siatka płac'!$B$6:$D$17,3,FALSE)-C591)*(13-'Zestawienie stanowisk'!$H$1)),\"-\")","v":"-"}]
[0,null,null,null,{"$f":"IFERROR((VLOOKUP(B592,'Zestawienie stanowisk'!$B$5:$E$65,4,FALSE)),\"-\")","v":"-"},{"$f":"IFERROR(((C592-(VLOOKUP(E592,'Siatka płac'!$B$6:$E$17,3,FALSE)))/(VLOOKUP(E592,'Siatka płac'!$B$6:$E$17,4,FALSE)-VLOOKUP(E592,'Siatka płac'!$B$6:$E$17,3,FALSE))),\"-\")","v":"-"},"-",{"$f":"IF(G592=\"poniżej min.\",((VLOOKUP(E592,'Siatka płac'!$B$6:$D$17,3,FALSE)-C592)*(13-'Zestawienie stanowisk'!$H$1)),\"-\")","v":"-"}]
[0,null,null,null,{"$f":"IFERROR((VLOOKUP(B593,'Zestawienie stanowisk'!$B$5:$E$65,4,FALSE)),\"-\")","v":"-"},{"$f":"IFERROR(((C593-(VLOOKUP(E593,'Siatka płac'!$B$6:$E$17,3,FALSE)))/(VLOOKUP(E593,'Siatka płac'!$B$6:$E$17,4,FALSE)-VLOOKUP(E593,'Siatka płac'!$B$6:$E$17,3,FALSE))),\"-\")","v":"-"},"-",{"$f":"IF(G593=\"poniżej min.\",((VLOOKUP(E593,'Siatka płac'!$B$6:$D$17,3,FALSE)-C593)*(13-'Zestawienie stanowisk'!$H$1)),\"-\")","v":"-"}]
[0,null,null,null,{"$f":"IFERROR((VLOOKUP(B594,'Zestawienie stanowisk'!$B$5:$E$65,4,FALSE)),\"-\")","v":"-"},{"$f":"IFERROR(((C594-(VLOOKUP(E594,'Siatka płac'!$B$6:$E$17,3,FALSE)))/(VLOOKUP(E594,'Siatka płac'!$B$6:$E$17,4,FALSE)-VLOOKUP(E594,'Siatka płac'!$B$6:$E$17,3,FALSE))),\"-\")","v":"-"},"-",{"$f":"IF(G594=\"poniżej min.\",((VLOOKUP(E594,'Siatka płac'!$B$6:$D$17,3,FALSE)-C594)*(13-'Zestawienie stanowisk'!$H$1)),\"-\")","v":"-"}]
[0,null,null,null,{"$f":"IFERROR((VLOOKUP(B595,'Zestawienie stanowisk'!$B$5:$E$65,4,FALSE)),\"-\")","v":"-"},{"$f":"IFERROR(((C595-(VLOOKUP(E595,'Siatka płac'!$B$6:$E$17,3,FALSE)))/(VLOOKUP(E595,'Siatka płac'!$B$6:$E$17,4,FALSE)-VLOOKUP(E595,'Siatka płac'!$B$6:$E$17,3,FALSE))),\"-\")","v":"-"},"-",{"$f":"IF(G595=\"poniżej min.\",((VLOOKUP(E595,'Siatka płac'!$B$6:$D$17,3,FALSE)-C595)*(13-'Zestawienie stanowisk'!$H$1)),\"-\")","v":"-"}]
[0,null,null,null,{"$f":"IFERROR((VLOOKUP(B596,'Zestawienie stanowisk'!$B$5:$E$65,4,FALSE)),\"-\")","v":"-"},{"$f":"IFERROR(((C596-(VLOOKUP(E596,'Siatka płac'!$B$6:$E$17,3,FALSE)))/(VLOOKUP(E596,'Siatka płac'!$B$6:$E$17,4,FALSE)-VLOOKUP(E596,'Siatka płac'!$B$6:$E$17,3,FALSE))),\"-\")","v":"-"},"-",{"$f":"IF(G596=\"poniżej min.\",((VLOOKUP(E596,'Siatka płac'!$B$6:$D$17,3,FALSE)-C596)*(13-'Zestawienie stanowisk'!$H$1)),\"-\")","v":"-"}]
[0,null,null,null,{"$f":"IFERROR((VLOOKUP(B597,'Zestawienie stanowisk'!$B$5:$E$65,4,FALSE)),\"-\")","v":"-"},{"$f":"IFERROR(((C597-(VLOOKUP(E597,'Siatka płac'!$B$6:$E$17,3,FALSE)))/(VLOOKUP(E597,'Siatka płac'!$B$6:$E$17,4,FALSE)-VLOOKUP(E597,'Siatka płac'!$B$6:$E$17,3,FALSE))),\"-\")","v":"-"},"-",{"$f":"IF(G597=\"poniżej min.\",((VLOOKUP(E597,'Siatka płac'!$B$6:$D$17,3,FALSE)-C597)*(13-'Zestawienie stanowisk'!$H$1)),\"-\")","v":"-"}]
[0,null,null,null,{"$f":"IFERROR((VLOOKUP(B598,'Zestawienie stanowisk'!$B$5:$E$65,4,FALSE)),\"-\")","v":"-"},{"$f":"IFERROR(((C598-(VLOOKUP(E598,'Siatka płac'!$B$6:$E$17,3,FALSE)))/(VLOOKUP(E598,'Siatka płac'!$B$6:$E$17,4,FALSE)-VLOOKUP(E598,'Siatka płac'!$B$6:$E$17,3,FALSE))),\"-\")","v":"-"},"-",{"$f":"IF(G598=\"poniżej min.\",((VLOOKUP(E598,'Siatka płac'!$B$6:$D$17,3,FALSE)-C598)*(13-'Zestawienie stanowisk'!$H$1)),\"-\")","v":"-"}]
[0,null,null,null,{"$f":"IFERROR((VLOOKUP(B599,'Zestawienie stanowisk'!$B$5:$E$65,4,FALSE)),\"-\")","v":"-"},{"$f":"IFERROR(((C599-(VLOOKUP(E599,'Siatka płac'!$B$6:$E$17,3,FALSE)))/(VLOOKUP(E599,'Siatka płac'!$B$6:$E$17,4,FALSE)-VLOOKUP(E599,'Siatka płac'!$B$6:$E$17,3,FALSE))),\"-\")","v":"-"},"-",{"$f":"IF(G599=\"poniżej min.\",((VLOOKUP(E599,'Siatka płac'!$B$6:$D$17,3,FALSE)-C599)*(13-'Zestawienie stanowisk'!$H$1)),\"-\")","v":"-"}]
[0,null,null,null,{"$f":"IFERROR((VLOOKUP(B600,'Zestawienie stanowisk'!$B$5:$E$65,4,FALSE)),\"-\")","v":"-"},{"$f":"IFERROR(((C600-(VLOOKUP(E600,'Siatka płac'!$B$6:$E$17,3,FALSE)))/(VLOOKUP(E600,'Siatka płac'!$B$6:$E$17,4,FALSE)-VLOOKUP(E600,'Siatka płac'!$B$6:$E$17,3,FALSE))),\"-\")","v":"-"},"-",{"$f":"IF(G600=\"poniżej min.\",((VLOOKUP(E600,'Siatka płac'!$B$6:$D$17,3,FALSE)-C600)*(13-'Zestawienie stanowisk'!$H$1)),\"-\")","v":"-"}]

{"sheet":"Lista objaśnienia","index":2,"n_rows":14,"n_cols":14,"rows_kept":14,"cut":false,"hidden":false,"merged":[[0,1,0,3],[2,5,2,6],[10,1,11,3],[10,7,16,7],[13,3,17,5],[1,3,2,4]]}
[null,"Lista pracowników",null,null,null,null,"Liczba pracowników:",{"$f":"SUM(A5:A7)","v":3}]
[null,"Lista pracowników","Menu","Przycisk uruchamiający makro, które zasili nazwami stanowisk zakładkę \"Zestawienie stanowisk\"   (uruchamiane raz)"]
[]
["po","Stanowisko","Wynagrodzenie zasadnicze brutto","Nazwisko i imię pracownika","Kategoria zaszeregowania","wartość compa ratio\n(miejsce w siatce płac)","Kwartyl w \nsiatce płac","koszt miesięczny \"podciągnięcia\" do minimum kategorii",null,null,null,null,{"$f":"MAX('Siatka płac'!B6:B17)","v":7}]
[1,"Monter",1500,"Pracownik 1",1,-0.25,"poniżej min.",500,null,null,null,null,10,"powyżej maks."]
[1,"Operator",2300,"Pracownik 2",1,0.15,"I","-",null,null,null,null,1,"IV"]
[1,"Elektryk",4500,"Pracownik 5",1,1.25,"powyżej maks.","-",null,null,null,null,0.25,"I"]
[]
[]
[]
[null,"Pola edytowalne na dane \"wejściowe\"",null,null,null,null,null,"Pole wyliczne automatycznie jeśli wynagrodzenie pracownika jest poniżej minimum kategorii zaszeregowania"]
[]
[]
[null,null,null,"miejce wynagrodzenia pracownika i kategorii zaszeregowania\n50% oznacza że wynagrodzenie jest jest w połowie kategorii\nWzór:\n(wynagrodzenie -minimum kategorii) / (maksimum kategorii - minimum kategorii)"]

{"sheet":"Zestawienie stanowisk","index":3,"n_rows":65,"n_cols":21,"rows_kept":65,"cut":false,"hidden":false,"merged":[[2,8,2,13],[2,15,2,20],[0,1,0,3],[0,5,0,6],[1,5,2,6],[1,7,2,7]]}
[null,"Zestawienie stanowisk",null,null,null,"Od którego miesiąca wprowadza się siatkę:",null,12]
[null,null,null,null,null,"Koszt wdrożenia siatki płac do końca roku bieżącego:",null,{"$f":"SUM('Lista pracowników'!$H$5:$H$650)","v":700}]
[null,"Objaśnienia","Siatka płac","Lista pracowników","Menu",null,null,null,"Liczebności pracowników w kwartylach ",null,null,null,null,null,null,"% liczeności pracowników w kwartylach "]
[null,"tekst",{"$f":"MAX('Siatka płac'!B6:B17)","v":7},null,null,null,null,null,"poniżej min.","I","II","III","IV","powyżej maks.",null,"poniżej min.","I","II","III","IV","powyżej maks."]
["Lp","Stanowisko","Pion","Poziom stanowiska","Kategoria zaszeregowania","Minimum\nkategorii w\nsiatce płac","Maksimum\nkategorii w\nsiatce płac","Liczba pracowników na stanowisku",{"$f":"SUM(I6:I261)","v":2},89,81,104,65,83,null,{"$f":"I5/SUM($I5:$N5)","v":4.7169811320754715E-3},{"$f":"J5/SUM($I5:$N5)","v":0.2099056603773585},0.19103773584905662,0.24528301886792453,0.15330188679245282,0.19575471698113209]
[1,"Monter",null,null,1,{"$f":"IF(E6>'Lista pracowników'!$M$4,\"-\",VLOOKUP($E6,'Siatka płac'!$B$6:$E$17,3,FALSE))","v":2000},{"$f":"IF(E6>'Lista pracowników'!$M$4,\"-\",VLOOKUP($E6,'Siatka płac'!$B$6:$E$17,4,FALSE))","v":4000},{"$f":"SUMIFS('Lista pracowników'!$A$5:$A$8578,'Lista pracowników'!$B$5:$B$8578,$B6)","v":158},{"$f":"SUMIFS('Lista pracowników'!$A$5:$A$3576,'Lista pracowników'!$G$5:$G$3576,I$4,'Lista pracowników'!$B$5:$B$3576,$B6)","v":1},{"$f":"SUMIFS('Lista pracowników'!$A$5:$A$3576,'Lista pracowników'!$G$5:$G$3576,J$4,'Lista pracowników'!$B$5:$B$3576,$B6)","v":59},{"$f":"SUMIFS('Lista pracowników'!$A$5:$A$3576,'Lista pracowników'!$G$5:$G$3576,K$4,'Lista pracowników'!$B$5:$B$3576,$B6)","v":31},{"$f":"SUMIFS('Lista pracowników'!$A$5:$A$3576,'Lista pracowników'!$G$5:$G$3576,L$4,'Lista pracowników'!$B$5:$B$3576,$B6)","v":67},{"$f":"SUMIFS('Lista pracowników'!$A$5:$A$3576,'Lista pracowników'!$G$5:$G$3576,M$4,'Lista pracowników'!$B$5:$B$3576,$B6)","v":0},{"$f":"SUMIFS('Lista pracowników'!$A$5:$A$3576,'Lista pracowników'!$G$5:$G$3576,N$4,'Lista pracowników'!$B$5:$B$3576,$B6)","v":0},null,{"$f":"IFERROR(((SUMIFS('Lista pracowników'!$A$5:$A$3576,'Lista pracowników'!$G$5:$G$3576,P$4,'Lista pracowników'!$B$5:$B$3576,$B6))/SUM($I6:$N6)),\"-\")","v":6.3291139240506328E-3},{"$f":"IFERROR(((SUMIFS('Lista pracowników'!$A$5:$A$3576,'Lista pracowników'!$G$5:$G$3576,Q$4,'Lista pracowników'!$B$5:$B$3576,$B6))/SUM($I6:$N6)),\"-\")","v":0.37341772151898733},{"$f":"IFERROR(((SUMIFS('Lista pracowników'!$A$5:$A$3576,'Lista pracowników'!$G$5:$G$3576,R$4,'Lista pracowników'!$B$5:$B$3576,$B6))/(SUM($I6:$N6))),\"-\")","v":0.19620253164556961},{"$f":"IFERROR(((SUMIFS('Lista pracowników'!$A$5:$A$3576,'Lista pracowników'!$G$5:$G$3576,S$4,'Lista pracowników'!$B$5:$B$3576,$B6))/SUM($I6:$N6)),\"-\")","v":0.42405063291139239},{"$f":"IFERROR(((SUMIFS('Lista pracowników'!$A$5:$A$3576,'Lista pracowników'!$G$5:$G$3576,T$4,'Lista pracowników'!$B$5:$B$3576,$B6))/SUM($I6:$N6)),\"-\")","v":0},{"$f":"IFERROR(((SUMIFS('Lista pracowników'!$A$5:$A$3576,'Lista pracowników'!$G$5:$G$3576,U$4,'Lista pracowników'!$B$5:$B$3576,$B6))/SUM($I6:$N6)),\"-\")","v":0}]
[2,"Operator",null,null,1,{"$f":"IF(E7>'Lista pracowników'!$M$4,\"-\",VLOOKUP($E7,'Siatka płac'!$B$6:$E$17,3,FALSE))","v":2000},{"$f":"IF(E7>'Lista pracowników'!$M$4,\"-\",VLOOKUP($E7,'Siatka płac'!$B$6:$E$17,4,FALSE))","v":4000},{"$f":"SUMIFS('Lista pracowników'!$A$5:$A$8386,'Lista pracowników'!$B$5:$B$8386,$B7)","v":50},{"$f":"SUMIFS('Lista pracowników'!$A$5:$A$3576,'Lista pracowników'!$G$5:$G$3576,I$4,'Lista pracowników'!$B$5:$B$3576,$B7)","v":0},{"$f":"SUMIFS('Lista pracowników'!$A$5:$A$3576,'Lista pracowników'!$G$5:$G$3576,J$4,'Lista pracowników'!$B$5:$B$3576,$B7)","v":30},{"$f":"SUMIFS('Lista pracowników'!$A$5:$A$3576,'Lista pracowników'!$G$5:$G$3576,K$4,'Lista pracowników'!$B$5:$B$3576,$B7)","v":13},{"$f":"SUMIFS('Lista pracowników'!$A$5:$A$3576,'Lista pracowników'!$G$5:$G$3576,L$4,'Lista pracowników'!$B$5:$B$3576,$B7)","v":6},{"$f":"SUMIFS('Lista pracowników'!$A$5:$A$3576,'Lista pracowników'!$G$5:$G$3576,M$4,'Lista pracowników'!$B$5:$B$3576,$B7)","v":1},{"$f":"SUMIFS('Lista pracowników'!$A$5:$A$3576,'Lista pracowników'!$G$5:$G$3576,N$4,'Lista pracowników'!$B$5:$B$3576,$B7)","v":0},null,{"$f":"IFERROR(((SUMIFS('Lista pracowników'!$A$5:$A$3576,'Lista pracowników'!$G$5:$G$3576,P$4,'Lista pracowników'!$B$5:$B$3576,$B7))/SUM($I7:$N7)),\"-\")","v":0},{"$f":"IFERROR(((SUMIFS('Lista pracowników'!$A$5:$A$3576,'Lista pracowników'!$G$5:$G$3576,Q$4,'Lista pracowników'!$B$5:$B$3576,$B7))/SUM($I7:$N7)),\"-\")","v":0.6},{"$f":"IFERROR(((SUMIFS('Lista pracowników'!$A$5:$A$3576,'Lista pracowników'!$G$5:$G$3576,R$4,'Lista pracowników'!$B$5:$B$3576,$B7))/(SUM($I7:$N7))),\"-\")","v":0.26},{"$f":"IFERROR(((SUMIFS('Lista pracowników'!$A$5:$A$3576,'Lista pracowników'!$G$5:$G$3576,S$4,'Lista pracowników'!$B$5:$B$3576,$B7))/SUM($I7:$N7)),\"-\")","v":0.12},{"$f":"IFERROR(((SUMIFS('Lista pracowników'!$A$5:$A$3576,'Lista pracowników'!$G$5:$G$3576,T$4,'Lista pracowników'!$B$5:$B$3576,$B7))/SUM($I7:$N7)),\"-\")","v":0.02},{"$f":"IFERROR(((SUMIFS('Lista pracowników'!$A$5:$A$3576,'Lista pracowników'!$G$5:$G$3576,U$4,'Lista pracowników'!$B$5:$B$3576,$B7))/SUM($I7:$N7)),\"-\")","v":0}]
[3,"Spawacz",null,null,1,{"$f":"IF(E8>'Lista pracowników'!$M$4,\"-\",VLOOKUP($E8,'Siatka płac'!$B$6:$E$17,3,FALSE))","v":2000},{"$f":"IF(E8>'Lista pracowników'!$M$4,\"-\",VLOOKUP($E8,'Siatka płac'!$B$6:$E$17,4,FALSE))","v":4000},{"$f":"SUMIFS('Lista pracowników'!$A$5:$A$8386,'Lista pracowników'!$B$5:$B$8386,$B8)","v":41},{"$f":"SUMIFS('Lista pracowników'!$A$5:$A$3576,'Lista pracowników'!$G$5:$G$3576,I$4,'Lista pracowników'!$B$5:$B$3576,$B8)","v":0},{"$f":"SUMIFS('Lista pracowników'!$A$5:$A$3576,'Lista pracowników'!$G$5:$G$3576,J$4,'Lista pracowników'!$B$5:$B$3576,$B8)","v":0},{"$f":"SUMIFS('Lista pracowników'!$A$5:$A$3576,'Lista pracowników'!$G$5:$G$3576,K$4,'Lista pracowników'!$B$5:$B$3576,$B8)","v":0},{"$f":"SUMIFS('Lista pracowników'!$A$5:$A$3576,'Lista pracowników'!$G$5:$G$3576,L$4,'Lista pracowników'!$B$5:$B$3576,$B8)","v":11},{"$f":"SUMIFS('Lista pracowników'!$A$5:$A$3576,'Lista pracowników'!$G$5:$G$3576,M$4,'Lista pracowników'!$B$5:$B$3576,$B8)","v":12},{"$f":"SUMIFS('Lista pracowników'!$A$5:$A$3576,'Lista pracowników'!$G$5:$G$3576,N$4,'Lista pracowników'!$B$5:$B$3576,$B8)","v":18},null,{"$f":"IFERROR(((SUMIFS('Lista pracowników'!$A$5:$A$3576,'Lista pracowników'!$G$5:$G$3576,P$4,'Lista pracowników'!$B$5:$B$3576,$B8))/SUM($I8:$N8)),\"-\")","v":0},{"$f":"IFERROR(((SUMIFS('Lista pracowników'!$A$5:$A$3576,'Lista pracowników'!$G$5:$G$3576,Q$4,'Lista pracowników'!$B$5:$B$3576,$B8))/SUM($I8:$N8)),\"-\")","v":0},{"$f":"IFERROR(((SUMIFS('Lista pracowników'!$A$5:$A$3576,'Lista pracowników'!$G$5:$G$3576,R$4,'Lista pracowników'!$B$5:$B$3576,$B8))/(SUM($I8:$N8))),\"-\")","v":0},{"$f":"IFERROR(((SUMIFS('Lista pracowników'!$A$5:$A$3576,'Lista pracowników'!$G$5:$G$3576,S$4,'Lista pracowników'!$B$5:$B$3576,$B8))/SUM($I8:$N8)),\"-\")","v":0.26829268292682928},{"$f":"IFERROR(((SUMIFS('Lista pracowników'!$A$5:$A$3576,'Lista pracowników'!$G$5:$G$3576,T$4,'Lista pracowników'!$B$5:$B$3576,$B8))/SUM($I8:$N8)),\"-\")","v":0.29268292682926828},{"$f":"IFERROR(((SUMIFS('Lista pracowników'!$A$5:$A$3576,'Lista pracowników'!$G$5:$G$3576,U$4,'Lista pracowników'!$B$5:$B$3576,$B8))/SUM($I8:$N8)),\"-\")","v":0.43902439024390244}]
[4,"Mechanik",null,null,1,{"$f":"IF(E9>'Lista pracowników'!$M$4,\"-\",VLOOKUP($E9,'Siatka płac'!$B$6:$E$17,3,FALSE))","v":2000},{"$f":"IF(E9>'Lista pracowników'!$M$4,\"-\",VLOOKUP($E9,'Siatka płac'!$B$6:$E$17,4,FALSE))","v":4000},{"$f":"SUMIFS('Lista pracowników'!$A$5:$A$8386,'Lista pracowników'!$B$5:$B$8386,$B9)","v":18},{"$f":"SUMIFS('Lista pracowników'!$A$5:$A$3576,'Lista pracowników'!$G$5:$G$3576,I$4,'Lista pracowników'!$B$5:$B$3576,$B9)","v":1},{"$f":"SUMIFS('Lista pracowników'!$A$5:$A$3576,'Lista pracowników'!$G$5:$G$3576,J$4,'Lista pracowników'!$B$5:$B$3576,$B9)","v":0},{"$f":"SUMIFS('Lista pracowników'!$A$5:$A$3576,'Lista pracowników'!$G$5:$G$3576,K$4,'Lista pracowników'!$B$5:$B$3576,$B9)","v":0},{"$f":"SUMIFS('Lista pracowników'!$A$5:$A$3576,'Lista pracowników'!$G$5:$G$3576,L$4,'Lista pracowników'!$B$5:$B$3576,$B9)","v":4},{"$f":"SUMIFS('Lista pracowników'!$A$5:$A$3576,'Lista pracowników'!$G$5:$G$3576,M$4,'Lista pracowników'!$B$5:$B$3576,$B9)","v":9},{"$f":"SUMIFS('Lista pracowników'!$A$5:$A$3576,'Lista pracowników'!$G$5:$G$3576,N$4,'Lista pracowników'!$B$5:$B$3576,$B9)","v":4},null,{"$f":"IFERROR(((SUMIFS('Lista pracowników'!$A$5:$A$3576,'Lista pracowników'!$G$5:$G$3576,P$4,'Lista pracowników'!$B$5:$B$3576,$B9))/SUM($I9:$N9)),\"-\")","v":5.5555555555555552E-2},{"$f":"IFERROR(((SUMIFS('Lista pracowników'!$A$5:$A$3576,'Lista pracowników'!$G$5:$G$3576,Q$4,'Lista pracowników'!$B$5:$B$3576,$B9))/SUM($I9:$N9)),\"-\")","v":0},{"$f":"IFERROR(((SUMIFS('Lista pracowników'!$A$5:$A$3576,'Lista pracowników'!$G$5:$G$3576,R$4,'Lista pracowników'!$B$5:$B$3576,$B9))/(SUM($I9:$N9))),\"-\")","v":0},{"$f":"IFERROR(((SUMIFS('Lista pracowników'!$A$5:$A$3576,'Lista pracowników'!$G$5:$G$3576,S$4,'Lista pracowników'!$B$5:$B$3576,$B9))/SUM($I9:$N9)),\"-\")","v":0.22222222222222221},{"$f":"IFERROR(((SUMIFS('Lista pracowników'!$A$5:$A$3576,'Lista pracowników'!$G$5:$G$3576,T$4,'Lista pracowników'!$B$5:$B$3576,$B9))/SUM($I9:$N9)),\"-\")","v":0.5},{"$f":"IFERROR(((SUMIFS('Lista pracowników'!$A$5:$A$3576,'Lista pracowników'!$G$5:$G$3576,U$4,'Lista pracowników'!$B$5:$B$3576,$B9))/SUM($I9:$N9)),\"-\")","v":0.22222222222222221}]
[5,"Elektryk",null,null,1,{"$f":"IF(E10>'Lista pracowników'!$M$4,\"-\",VLOOKUP($E10,'Siatka płac'!$B$6:$E$17,3,FALSE))","v":2000},{"$f":"IF(E10>'Lista pracowników'!$M$4,\"-\",VLOOKUP($E10,'Siatka płac'!$B$6:$E$17,4,FALSE))","v":4000},{"$f":"SUMIFS('Lista pracowników'!$A$5:$A$8386,'Lista pracowników'!$B$5:$B$8386,$B10)","v":7},{"$f":"SUMIFS('Lista pracowników'!$A$5:$A$3576,'Lista pracowników'!$G$5:$G$3576,I$4,'Lista pracowników'!$B$5:$B$3576,$B10)","v":0},{"$f":"SUMIFS('Lista pracowników'!$A$5:$A$3576,'Lista pracowników'!$G$5:$G$3576,J$4,'Lista pracowników'!$B$5:$B$3576,$B10)","v":0},{"$f":"SUMIFS('Lista pracowników'!$A$5:$A$3576,'Lista pracowników'!$G$5:$G$3576,K$4,'Lista pracowników'!$B$5:$B$3576,$B10)","v":0},{"$f":"SUMIFS('Lista pracowników'!$A$5:$A$3576,'Lista pracowników'!$G$5:$G$3576,L$4,'Lista pracowników'!$B$5:$B$3576,$B10)","v":1},{"$f":"SUMIFS('Lista pracowników'!$A$5:$A$3576,'Lista pracowników'!$G$5:$G$3576,M$4,'Lista pracowników'!$B$5:$B$3576,$B10)","v":2},{"$f":"SUMIFS('Lista pracowników'!$A$5:$A$3576,'Lista pracowników'!$G$5:$G$3576,N$4,'Lista pracowników'!$B$5:$B$3576,$B10)","v":4},null,{"$f":"IFERROR(((SUMIFS('Lista pracowników'!$A$5:$A$3576,'Lista pracowników'!$G$5:$G$3576,P$4,'Lista pracowników'!$B$5:$B$3576,$B10))/SUM($I10:$N10)),\"-\")","v":0},{"$f":"IFERROR(((SUMIFS('Lista pracowników'!$A$5:$A$3576,'Lista pracowników'!$G$5:$G$3576,Q$4,'Lista pracowników'!$B$5:$B$3576,$B10))/SUM($I10:$N10)),\"-\")","v":0},{"$f":"IFERROR(((SUMIFS('Lista pracowników'!$A$5:$A$3576,'Lista pracowników'!$G$5:$G$3576,R$4,'Lista pracowników'!$B$5:$B$3576,$B10))/(SUM($I10:$N10))),\"-\")","v":0},{"$f":"IFERROR(((SUMIFS('Lista pracowników'!$A$5:$A$3576,'Lista pracowników'!$G$5:$G$3576,S$4,'Lista pracowników'!$B$5:$B$3576,$B10))/SUM($I10:$N10)),\"-\")","v":0.14285714285714285},{"$f":"IFERROR(((SUMIFS('Lista pracowników'!$A$5:$A$3576,'Lista pracowników'!$G$5:$G$3576,T$4,'Lista pracowników'!$B$5:$B$3576,$B10))/SUM($I10:$N10)),\"-\")","v":0.2857142857142857},{"$f":"IFERROR(((SUMIFS('Lista pracowników'!$A$5:$A$3576,'Lista pracowników'!$G$5:$G$3576,U$4,'Lista pracowników'!$B$5:$B$3576,$B10))/SUM($I10:$N10)),\"-\")","v":0.5714285714285714}]
[6,"Kierowca",null,null,1,{"$f":"IF(E11>'Lista pracowników'!$M$4,\"-\",VLOOKUP($E11,'Siatka płac'!$B$6:$E$17,3,FALSE))","v":2000},{"$f":"IF(E11>'Lista pracowników'!$M$4,\"-\",VLOOKUP($E11,'Siatka płac'!$B$6:$E$17,4,FALSE))","v":4000},{"$f":"SUMIFS('Lista pracowników'!$A$5:$A$8386,'Lista pracowników'!$B$5:$B$8386,$B11)","v":17},{"$f":"SUMIFS('Lista pracowników'!$A$5:$A$3576,'Lista pracowników'!$G$5:$G$3576,I$4,'Lista pracowników'!$B$5:$B$3576,$B11)","v":0},{"$f":"SUMIFS('Lista pracowników'!$A$5:$A$3576,'Lista pracowników'!$G$5:$G$3576,J$4,'Lista pracowników'!$B$5:$B$3576,$B11)","v":0},{"$f":"SUMIFS('Lista pracowników'!$A$5:$A$3576,'Lista pracowników'!$G$5:$G$3576,K$4,'Lista pracowników'!$B$5:$B$3576,$B11)","v":1},{"$f":"SUMIFS('Lista pracowników'!$A$5:$A$3576,'Lista pracowników'!$G$5:$G$3576,L$4,'Lista pracowników'!$B$5:$B$3576,$B11)","v":4},{"$f":"SUMIFS('Lista pracowników'!$A$5:$A$3576,'Lista pracowników'!$G$5:$G$3576,M$4,'Lista pracowników'!$B$5:$B$3576,$B11)","v":8},{"$f":"SUMIFS('Lista pracowników'!$A$5:$A$3576,'Lista pracowników'!$G$5:$G$3576,N$4,'Lista pracowników'!$B$5:$B$3576,$B11)","v":4},null,{"$f":"IFERROR(((SUMIFS('Lista pracowników'!$A$5:$A$3576,'Lista pracowników'!$G$5:$G$3576,P$4,'Lista pracowników'!$B$5:$B$3576,$B11))/SUM($I11:$N11)),\"-\")","v":0},{"$f":"IFERROR(((SUMIFS('Lista pracowników'!$A$5:$A$3576,'Lista pracowników'!$G$5:$G$3576,Q$4,'Lista pracowników'!$B$5:$B$3576,$B11))/SUM($I11:$N11)),\"-\")","v":0},{"$f":"IFERROR(((SUMIFS('Lista pracowników'!$A$5:$A$3576,'Lista pracowników'!$G$5:$G$3576,R$4,'Lista pracowników'!$B$5:$B$3576,$B11))/(SUM($I11:$N11))),\"-\")","v":5.8823529411764705E-2},{"$f":"IFERROR(((SUMIFS('Lista pracowników'!$A$5:$A$3576,'Lista pracowników'!$G$5:$G$3576,S$4,'Lista pracowników'!$B$5:$B$3576,$B11))/SUM($I11:$N11)),\"-\")","v":0.23529411764705882},{"$f":"IFERROR(((SUMIFS('Lista pracowników'!$A$5:$A$3576,'Lista pracowników'!$G$5:$G$3576,T$4,'Lista pracowników'!$B$5:$B$3576,$B11))/SUM($I11:$N11)),\"-\")","v":0.47058823529411764},{"$f":"IFERROR(((SUMIFS('Lista pracowników'!$A$5:$A$3576,'Lista pracowników'!$G$5:$G$3576,U$4,'Lista pracowników'!$B$5:$B$3576,$B11))/SUM($I11:$N11)),\"-\")","v":0.23529411764705882}]
[7,"Automatyk",null,null,1,{"$f":"IF(E12>'Lista pracowników'!$M$4,\"-\",VLOOKUP($E12,'Siatka płac'!$B$6:$E$17,3,FALSE))","v":2000},{"$f":"IF(E12>'Lista pracowników'!$M$4,\"-\",VLOOKUP($E12,'Siatka płac'!$B$6:$E$17,4,FALSE))","v":4000},{"$f":"SUMIFS('Lista pracowników'!$A$5:$A$8386,'Lista pracowników'!$B$5:$B$8386,$B12)","v":11},{"$f":"SUMIFS('Lista pracowników'!$A$5:$A$3576,'Lista pracowników'!$G$5:$G$3576,I$4,'Lista pracowników'!$B$5:$B$3576,$B12)","v":0},{"$f":"SUMIFS('Lista pracowników'!$A$5:$A$3576,'Lista pracowników'!$G$5:$G$3576,J$4,'Lista pracowników'!$B$5:$B$3576,$B12)","v":0},{"$f":"SUMIFS('Lista pracowników'!$A$5:$A$3576,'Lista pracowników'!$G$5:$G$3576,K$4,'Lista pracowników'!$B$5:$B$3576,$B12)","v":0},{"$f":"SUMIFS('Lista pracowników'!$A$5:$A$3576,'Lista pracowników'!$G$5:$G$3576,L$4,'Lista pracowników'!$B$5:$B$3576,$B12)","v":0},{"$f":"SUMIFS('Lista pracowników'!$A$5:$A$3576,'Lista pracowników'!$G$5:$G$3576,M$4,'Lista pracowników'!$B$5:$B$3576,$B12)","v":0},{"$f":"SUMIFS('Lista pracowników'!$A$5:$A$3576,'Lista pracowników'!$G$5:$G$3576,N$4,'Lista pracowników'!$B$5:$B$3576,$B12)","v":11},null,{"$f":"IFERROR(((SUMIFS('Lista pracowników'!$A$5:$A$3576,'Lista pracowników'!$G$5:$G$3576,P$4,'Lista pracowników'!$B$5:$B$3576,$B12))/SUM($I12:$N12)),\"-\")","v":0},{"$f":"IFERROR(((SUMIFS('Lista pracowników'!$A$5:$A$3576,'Lista pracowników'!$G$5:$G$3576,Q$4,'Lista pracowników'!$B$5:$B$3576,$B12))/SUM($I12:$N12)),\"-\")","v":0},{"$f":"IFERROR(((SUMIFS('Lista pracowników'!$A$5:$A$3576,'Lista pracowników'!$G$5:$G$3576,R$4,'Lista pracowników'!$B$5:$B$3576,$B12))/(SUM($I12:$N12))),\"-\")","v":0},{"$f":"IFERROR(((SUMIFS('Lista pracowników'!$A$5:$A$3576,'Lista pracowników'!$G$5:$G$3576,S$4,'Lista pracowników'!$B$5:$B$3576,$B12))/SUM($I12:$N12)),\"-\")","v":0},{"$f":"IFERROR(((SUMIFS('Lista pracowników'!$A$5:$A$3576,'Lista pracowników'!$G$5:$G$3576,T$4,'Lista pracowników'!$B$5:$B$3576,$B12))/SUM($I12:$N12)),\"-\")","v":0},{"$f":"IFERROR(((SUMIFS('Lista pracowników'!$A$5:$A$3576,'Lista pracowników'!$G$5:$G$3576,U$4,'Lista pracowników'!$B$5:$B$3576,$B12))/SUM($I12:$N12)),\"-\")","v":1}]
[8,"Magazynier",null,null,1,{"$f":"IF(E13>'Lista pracowników'!$M$4,\"-\",VLOOKUP($E13,'Siatka płac'!$B$6:$E$17,3,FALSE))","v":2000},{"$f":"IF(E13>'Lista pracowników'!$M$4,\"-\",VLOOKUP($E13,'Siatka płac'!$B$6:$E$17,4,FALSE))","v":4000},{"$f":"SUMIFS('Lista pracowników'!$A$5:$A$8386,'Lista pracowników'!$B$5:$B$8386,$B13)","v":78},{"$f":"SUMIFS('Lista pracowników'!$A$5:$A$3576,'Lista pracowników'!$G$5:$G$3576,I$4,'Lista pracowników'!$B$5:$B$3576,$B13)","v":0},{"$f":"SUMIFS('Lista pracowników'!$A$5:$A$3576,'Lista pracowników'!$G$5:$G$3576,J$4,'Lista pracowników'!$B$5:$B$3576,$B13)","v":0},{"$f":"SUMIFS('Lista pracowników'!$A$5:$A$3576,'Lista pracowników'!$G$5:$G$3576,K$4,'Lista pracowników'!$B$5:$B$3576,$B13)","v":36},{"$f":"SUMIFS('Lista pracowników'!$A$5:$A$3576,'Lista pracowników'!$G$5:$G$3576,L$4,'Lista pracowników'!$B$5:$B$3576,$B13)","v":11},{"$f":"SUMIFS('Lista pracowników'!$A$5:$A$3576,'Lista pracowników'!$G$5:$G$3576,M$4,'Lista pracowników'!$B$5:$B$3576,$B13)","v":31},{"$f":"SUMIFS('Lista pracowników'!$A$5:$A$3576,'Lista pracowników'!$G$5:$G$3576,N$4,'Lista pracowników'!$B$5:$B$3576,$B13)","v":0},null,{"$f":"IFERROR(((SUMIFS('Lista pracowników'!$A$5:$A$3576,'Lista pracowników'!$G$5:$G$3576,P$4,'Lista pracowników'!$B$5:$B$3576,$B13))/SUM($I13:$N13)),\"-\")","v":0},{"$f":"IFERROR(((SUMIFS('Lista pracowników'!$A$5:$A$3576,'Lista pracowników'!$G$5:$G$3576,Q$4,'Lista pracowników'!$B$5:$B$3576,$B13))/SUM($I13:$N13)),\"-\")","v":0},{"$f":"IFERROR(((SUMIFS('Lista pracowników'!$A$5:$A$3576,'Lista pracowników'!$G$5:$G$3576,R$4,'Lista pracowników'!$B$5:$B$3576,$B13))/(SUM($I13:$N13))),\"-\")","v":0.46153846153846156},{"$f":"IFERROR(((SUMIFS('Lista pracowników'!$A$5:$A$3576,'Lista pracowników'!$G$5:$G$3576,S$4,'Lista pracowników'!$B$5:$B$3576,$B13))/SUM($I13:$N13)),\"-\")","v":0.14102564102564102},{"$f":"IFERROR(((SUMIFS('Lista pracowników'!$A$5:$A$3576,'Lista pracowników'!$G$5:$G$3576,T$4,'Lista pracowników'!$B$5:$B$3576,$B13))/SUM($I13:$N13)),\"-\")","v":0.39743589743589741},{"$f":"IFERROR(((SUMIFS('Lista pracowników'!$A$5:$A$3576,'Lista pracowników'!$G$5:$G$3576,U$4,'Lista pracowników'!$B$5:$B$3576,$B13))/SUM($I13:$N13)),\"-\")","v":0}]
[9,"Inżynier procesu",null,null,1,{"$f":"IF(E14>'Lista pracowników'!$M$4,\"-\",VLOOKUP($E14,'Siatka płac'!$B$6:$E$17,3,FALSE))","v":2000},{"$f":"IF(E14>'Lista pracowników'!$M$4,\"-\",VLOOKUP($E14,'Siatka płac'!$B$6:$E$17,4,FALSE))","v":4000},{"$f":"SUMIFS('Lista pracowników'!$A$5:$A$8386,'Lista pracowników'!$B$5:$B$8386,$B14)","v":10},{"$f":"SUMIFS('Lista pracowników'!$A$5:$A$3576,'Lista pracowników'!$G$5:$G$3576,I$4,'Lista pracowników'!$B$5:$B$3576,$B14)","v":0},{"$f":"SUMIFS('Lista pracowników'!$A$5:$A$3576,'Lista pracowników'!$G$5:$G$3576,J$4,'Lista pracowników'!$B$5:$B$3576,$B14)","v":0},{"$f":"SUMIFS('Lista pracowników'!$A$5:$A$3576,'Lista pracowników'!$G$5:$G$3576,K$4,'Lista pracowników'!$B$5:$B$3576,$B14)","v":0},{"$f":"SUMIFS('Lista pracowników'!$A$5:$A$3576,'Lista pracowników'!$G$5:$G$3576,L$4,'Lista pracowników'!$B$5:$B$3576,$B14)","v":0},{"$f":"SUMIFS('Lista pracowników'!$A$5:$A$3576,'Lista pracowników'!$G$5:$G$3576,M$4,'Lista pracowników'!$B$5:$B$3576,$B14)","v":0},{"$f":"SUMIFS('Lista pracowników'!$A$5:$A$3576,'Lista pracowników'!$G$5:$G$3576,N$4,'Lista pracowników'!$B$5:$B$3576,$B14)","v":10},null,{"$f":"IFERROR(((SUMIFS('Lista pracowników'!$A$5:$A$3576,'Lista pracowników'!$G$5:$G$3576,P$4,'Lista pracowników'!$B$5:$B$3576,$B14))/SUM($I14:$N14)),\"-\")","v":0},{"$f":"IFERROR(((SUMIFS('Lista pracowników'!$A$5:$A$3576,'Lista pracowników'!$G$5:$G$3576,Q$4,'Lista pracowników'!$B$5:$B$3576,$B14))/SUM($I14:$N14)),\"-\")","v":0},{"$f":"IFERROR(((SUMIFS('Lista pracowników'!$A$5:$A$3576,'Lista pracowników'!$G$5:$G$3576,R$4,'Lista pracowników'!$B$5:$B$3576,$B14))/(SUM($I14:$N14))),\"-\")","v":0},{"$f":"IFERROR(((SUMIFS('Lista pracowników'!$A$5:$A$3576,'Lista pracowników'!$G$5:$G$3576,S$4,'Lista pracowników'!$B$5:$B$3576,$B14))/SUM($I14:$N14)),\"-\")","v":0},{"$f":"IFERROR(((SUMIFS('Lista pracowników'!$A$5:$A$3576,'Lista pracowników'!$G$5:$G$3576,T$4,'Lista pracowników'!$B$5:$B$3576,$B14))/SUM($I14:$N14)),\"-\")","v":0},{"$f":"IFERROR(((SUMIFS('Lista pracowników'!$A$5:$A$3576,'Lista pracowników'!$G$5:$G$3576,U$4,'Lista pracowników'!$B$5:$B$3576,$B14))/SUM($I14:$N14)),\"-\")","v":1}]
[10,"Mistrz",null,null,1,{"$f":"IF(E15>'Lista pracowników'!$M$4,\"-\",VLOOKUP($E15,'Siatka płac'!$B$6:$E$17,3,FALSE))","v":2000},{"$f":"IF(E15>'Lista pracowników'!$M$4,\"-\",VLOOKUP($E15,'Siatka płac'!$B$6:$E$17,4,FALSE))","v":4000},{"$f":"SUMIFS('Lista pracowników'!$A$5:$A$8386,'Lista pracowników'!$B$5:$B$8386,$B15)","v":10},{"$f":"SUMIFS('Lista pracowników'!$A$5:$A$3576,'Lista pracowników'!$G$5:$G$3576,I$4,'Lista pracowników'!$B$5:$B$3576,$B15)","v":0},{"$f":"SUMIFS('Lista pracowników'!$A$5:$A$3576,'Lista pracowników'!$G$5:$G$3576,J$4,'Lista pracowników'!$B$5:$B$3576,$B15)","v":0},{"$f":"SUMIFS('Lista pracowników'!$A$5:$A$3576,'Lista pracowników'!$G$5:$G$3576,K$4,'Lista pracowników'!$B$5:$B$3576,$B15)","v":0},{"$f":"SUMIFS('Lista pracowników'!$A$5:$A$3576,'Lista pracowników'!$G$5:$G$3576,L$4,'Lista pracowników'!$B$5:$B$3576,$B15)","v":0},{"$f":"SUMIFS('Lista pracowników'!$A$5:$A$3576,'Lista pracowników'!$G$5:$G$3576,M$4,'Lista pracowników'!$B$5:$B$3576,$B15)","v":0},{"$f":"SUMIFS('Lista pracowników'!$A$5:$A$3576,'Lista pracowników'!$G$5:$G$3576,N$4,'Lista pracowników'!$B$5:$B$3576,$B15)","v":10},null,{"$f":"IFERROR(((SUMIFS('Lista pracowników'!$A$5:$A$3576,'Lista pracowników'!$G$5:$G$3576,P$4,'Lista pracowników'!$B$5:$B$3576,$B15))/SUM($I15:$N15)),\"-\")","v":0},{"$f":"IFERROR(((SUMIFS('Lista pracowników'!$A$5:$A$3576,'Lista pracowników'!$G$5:$G$3576,Q$4,'Lista pracowników'!$B$5:$B$3576,$B15))/SUM($I15:$N15)),\"-\")","v":0},{"$f":"IFERROR(((SUMIFS('Lista pracowników'!$A$5:$A$3576,'Lista pracowników'!$G$5:$G$3576,R$4,'Lista pracowników'!$B$5:$B$3576,$B15))/(SUM($I15:$N15))),\"-\")","v":0},{"$f":"IFERROR(((SUMIFS('Lista pracowników'!$A$5:$A$3576,'Lista pracowników'!$G$5:$G$3576,S$4,'Lista pracowników'!$B$5:$B$3576,$B15))/SUM($I15:$N15)),\"-\")","v":0},{"$f":"IFERROR(((SUMIFS('Lista pracowników'!$A$5:$A$3576,'Lista pracowników'!$G$5:$G$3576,T$4,'Lista pracowników'!$B$5:$B$3576,$B15))/SUM($I15:$N15)),\"-\")","v":0},{"$f":"IFERROR(((SUMIFS('Lista pracowników'!$A$5:$A$3576,'Lista pracowników'!$G$5:$G$3576,U$4,'Lista pracowników'!$B$5:$B$3576,$B15))/SUM($I15:$N15)),\"-\")","v":1}]
[11,"Specjalista ds. personalnych",null,null,1,{"$f":"IF(E16>'Lista pracowników'!$M$4,\"-\",VLOOKUP($E16,'Siatka płac'!$B$6:$E$17,3,FALSE))","v":2000},{"$f":"IF(E16>'Lista pracowników'!$M$4,\"-\",VLOOKUP($E16,'Siatka płac'!$B$6:$E$17,4,FALSE))","v":4000},{"$f":"SUMIFS('Lista pracowników'!$A$5:$A$8386,'Lista pracowników'!$B$5:$B$8386,$B16)","v":6},{"$f":"SUMIFS('Lista pracowników'!$A$5:$A$3576,'Lista pracowników'!$G$5:$G$3576,I$4,'Lista pracowników'!$B$5:$B$3576,$B16)","v":0},{"$f":"SUMIFS('Lista pracowników'!$A$5:$A$3576,'Lista pracowników'!$G$5:$G$3576,J$4,'Lista pracowników'!$B$5:$B$3576,$B16)","v":0},{"$f":"SUMIFS('Lista pracowników'!$A$5:$A$3576,'Lista pracowników'!$G$5:$G$3576,K$4,'Lista pracowników'!$B$5:$B$3576,$B16)","v":0},{"$f":"SUMIFS('Lista pracowników'!$A$5:$A$3576,'Lista pracowników'!$G$5:$G$3576,L$4,'Lista pracowników'!$B$5:$B$3576,$B16)","v":0},{"$f":"SUMIFS('Lista pracowników'!$A$5:$A$3576,'Lista pracowników'!$G$5:$G$3576,M$4,'Lista pracowników'!$B$5:$B$3576,$B16)","v":1},{"$f":"SUMIFS('Lista pracowników'!$A$5:$A$3576,'Lista pracowników'!$G$5:$G$3576,N$4,'Lista pracowników'!$B$5:$B$3576,$B16)","v":5},null,{"$f":"IFERROR(((SUMIFS('Lista pracowników'!$A$5:$A$3576,'Lista pracowników'!$G$5:$G$3576,P$4,'Lista pracowników'!$B$5:$B$3576,$B16))/SUM($I16:$N16)),\"-\")","v":0},{"$f":"IFERROR(((SUMIFS('Lista pracowników'!$A$5:$A$3576,'Lista pracowników'!$G$5:$G$3576,Q$4,'Lista pracowników'!$B$5:$B$3576,$B16))/SUM($I16:$N16)),\"-\")","v":0},{"$f":"IFERROR(((SUMIFS('Lista pracowników'!$A$5:$A$3576,'Lista pracowników'!$G$5:$G$3576,R$4,'Lista pracowników'!$B$5:$B$3576,$B16))/(SUM($I16:$N16))),\"-\")","v":0},{"$f":"IFERROR(((SUMIFS('Lista pracowników'!$A$5:$A$3576,'Lista pracowników'!$G$5:$G$3576,S$4,'Lista pracowników'!$B$5:$B$3576,$B16))/SUM($I16:$N16)),\"-\")","v":0},{"$f":"IFERROR(((SUMIFS('Lista pracowników'!$A$5:$A$3576,'Lista pracowników'!$G$5:$G$3576,T$4,'Lista pracowników'!$B$5:$B$3576,$B16))/SUM($I16:$N16)),\"-\")","v":0.16666666666666666},{"$f":"IFERROR(((SUMIFS('Lista pracowników'!$A$5:$A$3576,'Lista pracowników'!$G$5:$G$3576,U$4,'Lista pracowników'!$B$5:$B$3576,$B16))/SUM($I16:$N16)),\"-\")","v":0.83333333333333337}]
[12,"Administrator serwerów",null,null,1,{"$f":"IF(E17>'Lista pracowników'!$M$4,\"-\",VLOOKUP($E17,'Siatka płac'!$B$6:$E$17,3,FALSE))","v":2000},{"$f":"IF(E17>'Lista pracowników'!$M$4,\"-\",VLOOKUP($E17,'Siatka płac'!$B$6:$E$17,4,FALSE))","v":4000},{"$f":"SUMIFS('Lista pracowników'!$A$5:$A$8386,'Lista pracowników'!$B$5:$B$8386,$B17)","v":3},{"$f":"SUMIFS('Lista pracowników'!$A$5:$A$3576,'Lista pracowników'!$G$5:$G$3576,I$4,'Lista pracowników'!$B$5:$B$3576,$B17)","v":0},{"$f":"SUMIFS('Lista pracowników'!$A$5:$A$3576,'Lista pracowników'!$G$5:$G$3576,J$4,'Lista pracowników'!$B$5:$B$3576,$B17)","v":0},{"$f":"SUMIFS('Lista pracowników'!$A$5:$A$3576,'Lista pracowników'!$G$5:$G$3576,K$4,'Lista pracowników'!$B$5:$B$3576,$B17)","v":0},{"$f":"SUMIFS('Lista pracowników'!$A$5:$A$3576,'Lista pracowników'!$G$5:$G$3576,L$4,'Lista pracowników'!$B$5:$B$3576,$B17)","v":0},{"$f":"SUMIFS('Lista pracowników'!$A$5:$A$3576,'Lista pracowników'!$G$5:$G$3576,M$4,'Lista pracowników'!$B$5:$B$3576,$B17)","v":0},{"$f":"SUMIFS('Lista pracowników'!$A$5:$A$3576,'Lista pracowników'!$G$5:$G$3576,N$4,'Lista pracowników'!$B$5:$B$3576,$B17)","v":3},null,{"$f":"IFERROR(((SUMIFS('Lista pracowników'!$A$5:$A$3576,'Lista pracowników'!$G$5:$G$3576,P$4,'Lista pracowników'!$B$5:$B$3576,$B17))/SUM($I17:$N17)),\"-\")","v":0},{"$f":"IFERROR(((SUMIFS('Lista pracowników'!$A$5:$A$3576,'Lista pracowników'!$G$5:$G$3576,Q$4,'Lista pracowników'!$B$5:$B$3576,$B17))/SUM($I17:$N17)),\"-\")","v":0},{"$f":"IFERROR(((SUMIFS('Lista pracowników'!$A$5:$A$3576,'Lista pracowników'!$G$5:$G$3576,R$4,'Lista pracowników'!$B$5:$B$3576,$B17))/(SUM($I17:$N17))),\"-\")","v":0},{"$f":"IFERROR(((SUMIFS('Lista pracowników'!$A$5:$A$3576,'Lista pracowników'!$G$5:$G$3576,S$4,'Lista pracowników'!$B$5:$B$3576,$B17))/SUM($I17:$N17)),\"-\")","v":0},{"$f":"IFERROR(((SUMIFS('Lista pracowników'!$A$5:$A$3576,'Lista pracowników'!$G$5:$G$3576,T$4,'Lista pracowników'!$B$5:$B$3576,$B17))/SUM($I17:$N17)),\"-\")","v":0},{"$f":"IFERROR(((SUMIFS('Lista pracowników'!$A$5:$A$3576,'Lista pracowników'!$G$5:$G$3576,U$4,'Lista pracowników'!$B$5:$B$3576,$B17))/SUM($I17:$N17)),\"-\")","v":1}]
[13,"Specjalista ds. księgowych",null,null,1,{"$f":"IF(E18>'Lista pracowników'!$M$4,\"-\",VLOOKUP($E18,'Siatka płac'!$B$6:$E$17,3,FALSE))","v":2000},{"$f":"IF(E18>'Lista pracowników'!$M$4,\"-\",VLOOKUP($E18,'Siatka płac'!$B$6:$E$17,4,FALSE))","v":4000},{"$f":"SUMIFS('Lista pracowników'!$A$5:$A$8386,'Lista pracowników'!$B$5:$B$8386,$B18)","v":7},{"$f":"SUMIFS('Lista pracowników'!$A$5:$A$3576,'Lista pracowników'!$G$5:$G$3576,I$4,'Lista pracowników'!$B$5:$B$3576,$B18)","v":0},{"$f":"SUMIFS('Lista pracowników'!$A$5:$A$3576,'Lista pracowników'!$G$5:$G$3576,J$4,'Lista pracowników'!$B$5:$B$3576,$B18)","v":0},{"$f":"SUMIFS('Lista pracowników'!$A$5:$A$3576,'Lista pracowników'!$G$5:$G$3576,K$4,'Lista pracowników'!$B$5:$B$3576,$B18)","v":0},{"$f":"SUMIFS('Lista pracowników'!$A$5:$A$3576,'Lista pracowników'!$G$5:$G$3576,L$4,'Lista pracowników'!$B$5:$B$3576,$B18)","v":0},{"$f":"SUMIFS('Lista pracowników'!$A$5:$A$3576,'Lista pracowników'!$G$5:$G$3576,M$4,'Lista pracowników'!$B$5:$B$3576,$B18)","v":0},{"$f":"SUMIFS('Lista pracowników'!$A$5:$A$3576,'Lista pracowników'!$G$5:$G$3576,N$4,'Lista pracowników'!$B$5:$B$3576,$B18)","v":7},null,{"$f":"IFERROR(((SUMIFS('Lista pracowników'!$A$5:$A$3576,'Lista pracowników'!$G$5:$G$3576,P$4,'Lista pracowników'!$B$5:$B$3576,$B18))/SUM($I18:$N18)),\"-\")","v":0},{"$f":"IFERROR(((SUMIFS('Lista pracowników'!$A$5:$A$3576,'Lista pracowników'!$G$5:$G$3576,Q$4,'Lista pracowników'!$B$5:$B$3576,$B18))/SUM($I18:$N18)),\"-\")","v":0},{"$f":"IFERROR(((SUMIFS('Lista pracowników'!$A$5:$A$3576,'Lista pracowników'!$G$5:$G$3576,R$4,'Lista pracowników'!$B$5:$B$3576,$B18))/(SUM($I18:$N18))),\"-\")","v":0},{"$f":"IFERROR(((SUMIFS('Lista pracowników'!$A$5:$A$3576,'Lista pracowników'!$G$5:$G$3576,S$4,'Lista pracowników'!$B$5:$B$3576,$B18))/SUM($I18:$N18)),\"-\")","v":0},{"$f":"IFERROR(((SUMIFS('Lista pracowników'!$A$5:$A$3576,'Lista pracowników'!$G$5:$G$3576,T$4,'Lista pracowników'!$B$5:$B$3576,$B18))/SUM($I18:$N18)),\"-\")","v":0},{"$f":"IFERROR(((SUMIFS('Lista pracowników'!$A$5:$A$3576,'Lista pracowników'!$G$5:$G$3576,U$4,'Lista pracowników'!$B$5:$B$3576,$B18))/SUM($I18:$N18)),\"-\")","v":1}]
[14,"Specjalista ds. planowania",null,null,1,{"$f":"IF(E19>'Lista pracowników'!$M$4,\"-\",VLOOKUP($E19,'Siatka płac'!$B$6:$E$17,3,FALSE))","v":2000},{"$f":"IF(E19>'Lista pracowników'!$M$4,\"-\",VLOOKUP($E19,'Siatka płac'!$B$6:$E$17,4,FALSE))","v":4000},{"$f":"SUMIFS('Lista pracowników'!$A$5:$A$8386,'Lista pracowników'!$B$5:$B$8386,$B19)","v":5},{"$f":"SUMIFS('Lista pracowników'!$A$5:$A$3576,'Lista pracowników'!$G$5:$G$3576,I$4,'Lista pracowników'!$B$5:$B$3576,$B19)","v":0},{"$f":"SUMIFS('Lista pracowników'!$A$5:$A$3576,'Lista pracowników'!$G$5:$G$3576,J$4,'Lista pracowników'!$B$5:$B$3576,$B19)","v":0},{"$f":"SUMIFS('Lista pracowników'!$A$5:$A$3576,'Lista pracowników'!$G$5:$G$3576,K$4,'Lista pracowników'!$B$5:$B$3576,$B19)","v":0},{"$f":"SUMIFS('Lista pracowników'!$A$5:$A$3576,'Lista pracowników'!$G$5:$G$3576,L$4,'Lista pracowników'!$B$5:$B$3576,$B19)","v":0},{"$f":"SUMIFS('Lista pracowników'!$A$5:$A$3576,'Lista pracowników'!$G$5:$G$3576,M$4,'Lista pracowników'!$B$5:$B$3576,$B19)","v":1},{"$f":"SUMIFS('Lista pracowników'!$A$5:$A$3576,'Lista pracowników'!$G$5:$G$3576,N$4,'Lista pracowników'!$B$5:$B$3576,$B19)","v":4},null,{"$f":"IFERROR(((SUMIFS('Lista pracowników'!$A$5:$A$3576,'Lista pracowników'!$G$5:$G$3576,P$4,'Lista pracowników'!$B$5:$B$3576,$B19))/SUM($I19:$N19)),\"-\")","v":0},{"$f":"IFERROR(((SUMIFS('Lista pracowników'!$A$5:$A$3576,'Lista pracowników'!$G$5:$G$3576,Q$4,'Lista pracowników'!$B$5:$B$3576,$B19))/SUM($I19:$N19)),\"-\")","v":0},{"$f":"IFERROR(((SUMIFS('Lista pracowników'!$A$5:$A$3576,'Lista pracowników'!$G$5:$G$3576,R$4,'Lista pracowników'!$B$5:$B$3576,$B19))/(SUM($I19:$N19))),\"-\")","v":0},{"$f":"IFERROR(((SUMIFS('Lista pracowników'!$A$5:$A$3576,'Lista pracowników'!$G$5:$G$3576,S$4,'Lista pracowników'!$B$5:$B$3576,$B19))/SUM($I19:$N19)),\"-\")","v":0},{"$f":"IFERROR(((SUMIFS('Lista pracowników'!$A$5:$A$3576,'Lista pracowników'!$G$5:$G$3576,T$4,'Lista pracowników'!$B$5:$B$3576,$B19))/SUM($I19:$N19)),\"-\")","v":0.2},{"$f":"IFERROR(((SUMIFS('Lista pracowników'!$A$5:$A$3576,'Lista pracowników'!$G$5:$G$3576,U$4,'Lista pracowników'!$B$5:$B$3576,$B19))/SUM($I19:$N19)),\"-\")","v":0.8}]
[15,"Kierownik produkcji",null,null,1,{"$f":"IF(E20>'Lista pracowników'!$M$4,\"-\",VLOOKUP($E20,'Siatka płac'!$B$6:$E$17,3,FALSE))","v":2000},{"$f":"IF(E20>'Lista pracowników'!$M$4,\"-\",VLOOKUP($E20,'Siatka płac'!$B$6:$E$17,4,FALSE))","v":4000},{"$f":"SUMIFS('Lista pracowników'!$A$5:$A$8386,'Lista pracowników'!$B$5:$B$8386,$B20)","v":1},{"$f":"SUMIFS('Lista pracowników'!$A$5:$A$3576,'Lista pracowników'!$G$5:$G$3576,I$4,'Lista pracowników'!$B$5:$B$3576,$B20)","v":0},{"$f":"SUMIFS('Lista pracowników'!$A$5:$A$3576,'Lista pracowników'!$G$5:$G$3576,J$4,'Lista pracowników'!$B$5:$B$3576,$B20)","v":0},{"$f":"SUMIFS('Lista pracowników'!$A$5:$A$3576,'Lista pracowników'!$G$5:$G$3576,K$4,'Lista pracowników'!$B$5:$B$3576,$B20)","v":0},{"$f":"SUMIFS('Lista pracowników'!$A$5:$A$3576,'Lista pracowników'!$G$5:$G$3576,L$4,'Lista pracowników'!$B$5:$B$3576,$B20)","v":0},{"$f":"SUMIFS('Lista pracowników'!$A$5:$A$3576,'Lista pracowników'!$G$5:$G$3576,M$4,'Lista pracowników'!$B$5:$B$3576,$B20)","v":0},{"$f":"SUMIFS('Lista pracowników'!$A$5:$A$3576,'Lista pracowników'!$G$5:$G$3576,N$4,'Lista pracowników'!$B$5:$B$3576,$B20)","v":1},null,{"$f":"IFERROR(((SUMIFS('Lista pracowników'!$A$5:$A$3576,'Lista pracowników'!$G$5:$G$3576,P$4,'Lista pracowników'!$B$5:$B$3576,$B20))/SUM($I20:$N20)),\"-\")","v":0},{"$f":"IFERROR(((SUMIFS('Lista pracowników'!$A$5:$A$3576,'Lista pracowników'!$G$5:$G$3576,Q$4,'Lista pracowników'!$B$5:$B$3576,$B20))/SUM($I20:$N20)),\"-\")","v":0},{"$f":"IFERROR(((SUMIFS('Lista pracowników'!$A$5:$A$3576,'Lista pracowników'!$G$5:$G$3576,R$4,'Lista pracowników'!$B$5:$B$3576,$B20))/(SUM($I20:$N20))),\"-\")","v":0},{"$f":"IFERROR(((SUMIFS('Lista pracowników'!$A$5:$A$3576,'Lista pracowników'!$G$5:$G$3576,S$4,'Lista pracowników'!$B$5:$B$3576,$B20))/SUM($I20:$N20)),\"-\")","v":0},{"$f":"IFERROR(((SUMIFS('Lista pracowników'!$A$5:$A$3576,'Lista pracowników'!$G$5:$G$3576,T$4,'Lista pracowników'!$B$5:$B$3576,$B20))/SUM($I20:$N20)),\"-\")","v":0},{"$f":"IFERROR(((SUMIFS('Lista pracowników'!$A$5:$A$3576,'Lista pracowników'!$G$5:$G$3576,U$4,'Lista pracowników'!$B$5:$B$3576,$B20))/SUM($I20:$N20)),\"-\")","v":1}]
[16,"Kierownik działu jakości",null,null,1,{"$f":"IF(E21>'Lista pracowników'!$M$4,\"-\",VLOOKUP($E21,'Siatka płac'!$B$6:$E$17,3,FALSE))","v":2000},{"$f":"IF(E21>'Lista pracowników'!$M$4,\"-\",VLOOKUP($E21,'Siatka płac'!$B$6:$E$17,4,FALSE))","v":4000},{"$f":"SUMIFS('Lista pracowników'!$A$5:$A$8386,'Lista pracowników'!$B$5:$B$8386,$B21)","v":1},{"$f":"SUMIFS('Lista pracowników'!$A$5:$A$3576,'Lista pracowników'!$G$5:$G$3576,I$4,'Lista pracowników'!$B$5:$B$3576,$B21)","v":0},{"$f":"SUMIFS('Lista pracowników'!$A$5:$A$3576,'Lista pracowników'!$G$5:$G$3576,J$4,'Lista pracowników'!$B$5:$B$3576,$B21)","v":0},{"$f":"SUMIFS('Lista pracowników'!$A$5:$A$3576,'Lista pracowników'!$G$5:$G$3576,K$4,'Lista pracowników'!$B$5:$B$3576,$B21)","v":0},{"$f":"SUMIFS('Lista pracowników'!$A$5:$A$3576,'Lista pracowników'!$G$5:$G$3576,L$4,'Lista pracowników'!$B$5:$B$3576,$B21)","v":0},{"$f":"SUMIFS('Lista pracowników'!$A$5:$A$3576,'Lista pracowników'!$G$5:$G$3576,M$4,'Lista pracowników'!$B$5:$B$3576,$B21)","v":0},{"$f":"SUMIFS('Lista pracowników'!$A$5:$A$3576,'Lista pracowników'!$G$5:$G$3576,N$4,'Lista pracowników'!$B$5:$B$3576,$B21)","v":1},null,{"$f":"IFERROR(((SUMIFS('Lista pracowników'!$A$5:$A$3576,'Lista pracowników'!$G$5:$G$3576,P$4,'Lista pracowników'!$B$5:$B$3576,$B21))/SUM($I21:$N21)),\"-\")","v":0},{"$f":"IFERROR(((SUMIFS('Lista pracowników'!$A$5:$A$3576,'Lista pracowników'!$G$5:$G$3576,Q$4,'Lista pracowników'!$B$5:$B$3576,$B21))/SUM($I21:$N21)),\"-\")","v":0},{"$f":"IFERROR(((SUMIFS('Lista pracowników'!$A$5:$A$3576,'Lista pracowników'!$G$5:$G$3576,R$4,'Lista pracowników'!$B$5:$B$3576,$B21))/(SUM($I21:$N21))),\"-\")","v":0},{"$f":"IFERROR(((SUMIFS('Lista pracowników'!$A$5:$A$3576,'Lista pracowników'!$G$5:$G$3576,S$4,'Lista pracowników'!$B$5:$B$3576,$B21))/SUM($I21:$N21)),\"-\")","v":0},{"$f":"IFERROR(((SUMIFS('Lista pracowników'!$A$5:$A$3576,'Lista pracowników'!$G$5:$G$3576,T$4,'Lista pracowników'!$B$5:$B$3576,$B21))/SUM($I21:$N21)),\"-\")","v":0},{"$f":"IFERROR(((SUMIFS('Lista pracowników'!$A$5:$A$3576,'Lista pracowników'!$G$5:$G$3576,U$4,'Lista pracowników'!$B$5:$B$3576,$B21))/SUM($I21:$N21)),\"-\")","v":1}]
[17,"Kierownik magazynu",null,null,1,{"$f":"IF(E22>'Lista pracowników'!$M$4,\"-\",VLOOKUP($E22,'Siatka płac'!$B$6:$E$17,3,FALSE))","v":2000},{"$f":"IF(E22>'Lista pracowników'!$M$4,\"-\",VLOOKUP($E22,'Siatka płac'!$B$6:$E$17,4,FALSE))","v":4000},{"$f":"SUMIFS('Lista pracowników'!$A$5:$A$8386,'Lista pracowników'!$B$5:$B$8386,$B22)","v":1},{"$f":"SUMIFS('Lista pracowników'!$A$5:$A$3576,'Lista pracowników'!$G$5:$G$3576,I$4,'Lista pracowników'!$B$5:$B$3576,$B22)","v":0},{"$f":"SUMIFS('Lista pracowników'!$A$5:$A$3576,'Lista pracowników'!$G$5:$G$3576,J$4,'Lista pracowników'!$B$5:$B$3576,$B22)","v":0},{"$f":"SUMIFS('Lista pracowników'!$A$5:$A$3576,'Lista pracowników'!$G$5:$G$3576,K$4,'Lista pracowników'!$B$5:$B$3576,$B22)","v":0},{"$f":"SUMIFS('Lista pracowników'!$A$5:$A$3576,'Lista pracowników'!$G$5:$G$3576,L$4,'Lista pracowników'!$B$5:$B$3576,$B22)","v":0},{"$f":"SUMIFS('Lista pracowników'!$A$5:$A$3576,'Lista pracowników'!$G$5:$G$3576,M$4,'Lista pracowników'!$B$5:$B$3576,$B22)","v":0},{"$f":"SUMIFS('Lista pracowników'!$A$5:$A$3576,'Lista pracowników'!$G$5:$G$3576,N$4,'Lista pracowników'!$B$5:$B$3576,$B22)","v":1},null,{"$f":"IFERROR(((SUMIFS('Lista pracowników'!$A$5:$A$3576,'Lista pracowników'!$G$5:$G$3576,P$4,'Lista pracowników'!$B$5:$B$3576,$B22))/SUM($I22:$N22)),\"-\")","v":0},{"$f":"IFERROR(((SUMIFS('Lista pracowników'!$A$5:$A$3576,'Lista pracowników'!$G$5:$G$3576,Q$4,'Lista pracowników'!$B$5:$B$3576,$B22))/SUM($I22:$N22)),\"-\")","v":0},{"$f":"IFERROR(((SUMIFS('Lista pracowników'!$A$5:$A$3576,'Lista pracowników'!$G$5:$G$3576,R$4,'Lista pracowników'!$B$5:$B$3576,$B22))/(SUM($I22:$N22))),\"-\")","v":0},{"$f":"IFERROR(((SUMIFS('Lista pracowników'!$A$5:$A$3576,'Lista pracowników'!$G$5:$G$3576,S$4,'Lista pracowników'!$B$5:$B$3576,$B22))/SUM($I22:$N22)),\"-\")","v":0},{"$f":"IFERROR(((SUMIFS('Lista pracowników'!$A$5:$A$3576,'Lista pracowników'!$G$5:$G$3576,T$4,'Lista pracowników'!$B$5:$B$3576,$B22))/SUM($I22:$N22)),\"-\")","v":0},{"$f":"IFERROR(((SUMIFS('Lista pracowników'!$A$5:$A$3576,'Lista pracowników'!$G$5:$G$3576,U$4,'Lista pracowników'!$B$5:$B$3576,$B22))/SUM($I22:$N22)),\"-\")","v":1}]
[18,"Dyrektor finansowy",null,null,1,{"$f":"IF(E23>'Lista pracowników'!$M$4,\"-\",VLOOKUP($E23,'Siatka płac'!$B$6:$E$17,3,FALSE))","v":2000},{"$f":"IF(E23>'Lista pracowników'!$M$4,\"-\",VLOOKUP($E23,'Siatka płac'!$B$6:$E$17,4,FALSE))","v":4000},{"$f":"SUMIFS('Lista pracowników'!$A$5:$A$8386,'Lista pracowników'!$B$5:$B$8386,$B23)","v":1},{"$f":"SUMIFS('Lista pracowników'!$A$5:$A$3576,'Lista pracowników'!$G$5:$G$3576,I$4,'Lista pracowników'!$B$5:$B$3576,$B23)","v":0},{"$f":"SUMIFS('Lista pracowników'!$A$5:$A$3576,'Lista pracowników'!$G$5:$G$3576,J$4,'Lista pracowników'!$B$5:$B$3576,$B23)","v":0},{"$f":"SUMIFS('Lista pracowników'!$A$5:$A$3576,'Lista pracowników'!$G$5:$G$3576,K$4,'Lista pracowników'!$B$5:$B$3576,$B23)","v":0},{"$f":"SUMIFS('Lista pracowników'!$A$5:$A$3576,'Lista pracowników'!$G$5:$G$3576,L$4,'Lista pracowników'!$B$5:$B$3576,$B23)","v":0},{"$f":"SUMIFS('Lista pracowników'!$A$5:$A$3576,'Lista pracowników'!$G$5:$G$3576,M$4,'Lista pracowników'!$B$5:$B$3576,$B23)","v":0},{"$f":"SUMIFS('Lista pracowników'!$A$5:$A$3576,'Lista pracowników'!$G$5:$G$3576,N$4,'Lista pracowników'!$B$5:$B$3576,$B23)","v":0},null,{"$f":"IFERROR(((SUMIFS('Lista pracowników'!$A$5:$A$3576,'Lista pracowników'!$G$5:$G$3576,P$4,'Lista pracowników'!$B$5:$B$3576,$B23))/SUM($I23:$N23)),\"-\")","v":"-"},{"$f":"IFERROR(((SUMIFS('Lista pracowników'!$A$5:$A$3576,'Lista pracowników'!$G$5:$G$3576,Q$4,'Lista pracowników'!$B$5:$B$3576,$B23))/SUM($I23:$N23)),\"-\")","v":"-"},{"$f":"IFERROR(((SUMIFS('Lista pracowników'!$A$5:$A$3576,'Lista pracowników'!$G$5:$G$3576,R$4,'Lista pracowników'!$B$5:$B$3576,$B23))/(SUM($I23:$N23))),\"-\")","v":"-"},{"$f":"IFERROR(((SUMIFS('Lista pracowników'!$A$5:$A$3576,'Lista pracowników'!$G$5:$G$3576,S$4,'Lista pracowników'!$B$5:$B$3576,$B23))/SUM($I23:$N23)),\"-\")","v":"-"},{"$f":"IFERROR(((SUMIFS('Lista pracowników'!$A$5:$A$3576,'Lista pracowników'!$G$5:$G$3576,T$4,'Lista pracowników'!$B$5:$B$3576,$B23))/SUM($I23:$N23)),\"-\")","v":"-"},{"$f":"IFERROR(((SUMIFS('Lista pracowników'!$A$5:$A$3576,'Lista pracowników'!$G$5:$G$3576,U$4,'Lista pracowników'!$B$5:$B$3576,$B23))/SUM($I23:$N23)),\"-\")","v":"-"}]
[19,"Dyrektor produkcji",null,null,1,{"$f":"IF(E24>'Lista pracowników'!$M$4,\"-\",VLOOKUP($E24,'Siatka płac'!$B$6:$E$17,3,FALSE))","v":2000},{"$f":"IF(E24>'Lista pracowników'!$M$4,\"-\",VLOOKUP($E24,'Siatka płac'!$B$6:$E$17,4,FALSE))","v":4000},{"$f":"SUMIFS('Lista pracowników'!$A$5:$A$8386,'Lista pracowników'!$B$5:$B$8386,$B24)","v":1},{"$f":"SUMIFS('Lista pracowników'!$A$5:$A$3576,'Lista pracowników'!$G$5:$G$3576,I$4,'Lista pracowników'!$B$5:$B$3576,$B24)","v":0},{"$f":"SUMIFS('Lista pracowników'!$A$5:$A$3576,'Lista pracowników'!$G$5:$G$3576,J$4,'Lista pracowników'!$B$5:$B$3576,$B24)","v":0},{"$f":"SUMIFS('Lista pracowników'!$A$5:$A$3576,'Lista pracowników'!$G$5:$G$3576,K$4,'Lista pracowników'!$B$5:$B$3576,$B24)","v":0},{"$f":"SUMIFS('Lista pracowników'!$A$5:$A$3576,'Lista pracowników'!$G$5:$G$3576,L$4,'Lista pracowników'!$B$5:$B$3576,$B24)","v":0},{"$f":"SUMIFS('Lista pracowników'!$A$5:$A$3576,'Lista pracowników'!$G$5:$G$3576,M$4,'Lista pracowników'!$B$5:$B$3576,$B24)","v":0},{"$f":"SUMIFS('Lista pracowników'!$A$5:$A$3576,'Lista pracowników'!$G$5:$G$3576,N$4,'Lista pracowników'!$B$5:$B$3576,$B24)","v":0},null,{"$f":"IFERROR(((SUMIFS('Lista pracowników'!$A$5:$A$3576,'Lista pracowników'!$G$5:$G$3576,P$4,'Lista pracowników'!$B$5:$B$3576,$B24))/SUM($I24:$N24)),\"-\")","v":"-"},{"$f":"IFERROR(((SUMIFS('Lista pracowników'!$A$5:$A$3576,'Lista pracowników'!$G$5:$G$3576,Q$4,'Lista pracowników'!$B$5:$B$3576,$B24))/SUM($I24:$N24)),\"-\")","v":"-"},{"$f":"IFERROR(((SUMIFS('Lista pracowników'!$A$5:$A$3576,'Lista pracowników'!$G$5:$G$3576,R$4,'Lista pracowników'!$B$5:$B$3576,$B24))/(SUM($I24:$N24))),\"-\")","v":"-"},{"$f":"IFERROR(((SUMIFS('Lista pracowników'!$A$5:$A$3576,'Lista pracowników'!$G$5:$G$3576,S$4,'Lista pracowników'!$B$5:$B$3576,$B24))/SUM($I24:$N24)),\"-\")","v":"-"},{"$f":"IFERROR(((SUMIFS('Lista pracowników'!$A$5:$A$3576,'Lista pracowników'!$G$5:$G$3576,T$4,'Lista pracowników'!$B$5:$B$3576,$B24))/SUM($I24:$N24)),\"-\")","v":"-"},{"$f":"IFERROR(((SUMIFS('Lista pracowników'!$A$5:$A$3576,'Lista pracowników'!$G$5:$G$3576,U$4,'Lista pracowników'!$B$5:$B$3576,$B24))/SUM($I24:$N24)),\"-\")","v":"-"}]
[20,null,null,null,null,{"$f":"IF(E25>'Lista pracowników'!$M$4,\"-\",VLOOKUP($E25,'Siatka płac'!$B$6:$E$17,3,FALSE))","v":0},{"$f":"IF(E25>'Lista pracowników'!$M$4,\"-\",VLOOKUP($E25,'Siatka płac'!$B$6:$E$17,4,FALSE))","v":0},{"$f":"SUMIFS('Lista pracowników'!$A$5:$A$8386,'Lista pracowników'!$B$5:$B$8386,$B25)","v":0},{"$f":"SUMIFS('Lista pracowników'!$A$5:$A$3576,'Lista pracowników'!$G$5:$G$3576,I$4,'Lista pracowników'!$B$5:$B$3576,$B25)","v":0},{"$f":"SUMIFS('Lista pracowników'!$A$5:$A$3576,'Lista pracowników'!$G$5:$G$3576,J$4,'Lista pracowników'!$B$5:$B$3576,$B25)","v":0},{"$f":"SUMIFS('Lista pracowników'!$A$5:$A$3576,'Lista pracowników'!$G$5:$G$3576,K$4,'Lista pracowników'!$B$5:$B$3576,$B25)","v":0},{"$f":"SUMIFS('Lista pracowników'!$A$5:$A$3576,'Lista pracowników'!$G$5:$G$3576,L$4,'Lista pracowników'!$B$5:$B$3576,$B25)","v":0},{"$f":"SUMIFS('Lista pracowników'!$A$5:$A$3576,'Lista pracowników'!$G$5:$G$3576,M$4,'Lista pracowników'!$B$5:$B$3576,$B25)","v":0},{"$f":"SUMIFS('Lista pracowników'!$A$5:$A$3576,'Lista pracowników'!$G$5:$G$3576,N$4,'Lista pracowników'!$B$5:$B$3576,$B25)","v":0},null,{"$f":"IFERROR(((SUMIFS('Lista pracowników'!$A$5:$A$3576,'Lista pracowników'!$G$5:$G$3576,P$4,'Lista pracowników'!$B$5:$B$3576,$B25))/SUM($I25:$N25)),\"-\")","v":"-"},{"$f":"IFERROR(((SUMIFS('Lista pracowników'!$A$5:$A$3576,'Lista pracowników'!$G$5:$G$3576,Q$4,'Lista pracowników'!$B$5:$B$3576,$B25))/SUM($I25:$N25)),\"-\")","v":"-"},{"$f":"IFERROR(((SUMIFS('Lista pracowników'!$A$5:$A$3576,'Lista pracowników'!$G$5:$G$3576,R$4,'Lista pracowników'!$B$5:$B$3576,$B25))/(SUM($I25:$N25))),\"-\")","v":"-"},{"$f":"IFERROR(((SUMIFS('Lista pracowników'!$A$5:$A$3576,'Lista pracowników'!$G$5:$G$3576,S$4,'Lista pracowników'!$B$5:$B$3576,$B25))/SUM($I25:$N25)),\"-\")","v":"-"},{"$f":"IFERROR(((SUMIFS('Lista pracowników'!$A$5:$A$3576,'Lista pracowników'!$G$5:$G$3576,T$4,'Lista pracowników'!$B$5:$B$3576,$B25))/SUM($I25:$N25)),\"-\")","v":"-"},{"$f":"IFERROR(((SUMIFS('Lista pracowników'!$A$5:$A$3576,'Lista pracowników'!$G$5:$G$3576,U$4,'Lista pracowników'!$B$5:$B$3576,$B25))/SUM($I25:$N25)),\"-\")","v":"-"}]
[21,null,null,null,null,{"$f":"IF(E26>'Lista pracowników'!$M$4,\"-\",VLOOKUP($E26,'Siatka płac'!$B$6:$E$17,3,FALSE))","v":0},{"$f":"IF(E26>'Lista pracowników'!$M$4,\"-\",VLOOKUP($E26,'Siatka płac'!$B$6:$E$17,4,FALSE))","v":0},{"$f":"SUMIFS('Lista pracowników'!$A$5:$A$8386,'Lista pracowników'!$B$5:$B$8386,$B26)","v":0},{"$f":"SUMIFS('Lista pracowników'!$A$5:$A$3576,'Lista pracowników'!$G$5:$G$3576,I$4,'Lista pracowników'!$B$5:$B$3576,$B26)","v":0},{"$f":"SUMIFS('Lista pracowników'!$A$5:$A$3576,'Lista pracowników'!$G$5:$G$3576,J$4,'Lista pracowników'!$B$5:$B$3576,$B26)","v":0},{"$f":"SUMIFS('Lista pracowników'!$A$5:$A$3576,'Lista pracowników'!$G$5:$G$3576,K$4,'Lista pracowników'!$B$5:$B$3576,$B26)","v":0},{"$f":"SUMIFS('Lista pracowników'!$A$5:$A$3576,'Lista pracowników'!$G$5:$G$3576,L$4,'Lista pracowników'!$B$5:$B$3576,$B26)","v":0},{"$f":"SUMIFS('Lista pracowników'!$A$5:$A$3576,'Lista pracowników'!$G$5:$G$3576,M$4,'Lista pracowników'!$B$5:$B$3576,$B26)","v":0},{"$f":"SUMIFS('Lista pracowników'!$A$5:$A$3576,'Lista pracowników'!$G$5:$G$3576,N$4,'Lista pracowników'!$B$5:$B$3576,$B26)","v":0},null,{"$f":"IFERROR(((SUMIFS('Lista pracowników'!$A$5:$A$3576,'Lista pracowników'!$G$5:$G$3576,P$4,'Lista pracowników'!$B$5:$B$3576,$B26))/SUM($I26:$N26)),\"-\")","v":"-"},{"$f":"IFERROR(((SUMIFS('Lista pracowników'!$A$5:$A$3576,'Lista pracowników'!$G$5:$G$3576,Q$4,'Lista pracowników'!$B$5:$B$3576,$B26))/SUM($I26:$N26)),\"-\")","v":"-"},{"$f":"IFERROR(((SUMIFS('Lista pracowników'!$A$5:$A$3576,'Lista pracowników'!$G$5:$G$3576,R$4,'Lista pracowników'!$B$5:$B$3576,$B26))/(SUM($I26:$N26))),\"-\")","v":"-"},{"$f":"IFERROR(((SUMIFS('Lista pracowników'!$A$5:$A$3576,'Lista pracowników'!$G$5:$G$3576,S$4,'Lista pracowników'!$B$5:$B$3576,$B26))/SUM($I26:$N26)),\"-\")","v":"-"},{"$f":"IFERROR(((SUMIFS('Lista pracowników'!$A$5:$A$3576,'Lista pracowników'!$G$5:$G$3576,T$4,'Lista pracowników'!$B$5:$B$3576,$B26))/SUM($I26:$N26)),\"-\")","v":"-"},{"$f":"IFERROR(((SUMIFS('Lista pracowników'!$A$5:$A$3576,'Lista pracowników'!$G$5:$G$3576,U$4,'Lista pracowników'!$B$5:$B$3576,$B26))/SUM($I26:$N26)),\"-\")","v":"-"}]
[22,null,null,null,null,{"$f":"IF(E27>'Lista pracowników'!$M$4,\"-\",VLOOKUP($E27,'Siatka płac'!$B$6:$E$17,3,FALSE))","v":0},{"$f":"IF(E27>'Lista pracowników'!$M$4,\"-\",VLOOKUP($E27,'Siatka płac'!$B$6:$E$17,4,FALSE))","v":0},{"$f":"SUMIFS('Lista pracowników'!$A$5:$A$8386,'Lista pracowników'!$B$5:$B$8386,$B27)","v":0},{"$f":"SUMIFS('Lista pracowników'!$A$5:$A$3576,'Lista pracowników'!$G$5:$G$3576,I$4,'Lista pracowników'!$B$5:$B$3576,$B27)","v":0},{"$f":"SUMIFS('Lista pracowników'!$A$5:$A$3576,'Lista pracowników'!$G$5:$G$3576,J$4,'Lista pracowników'!$B$5:$B$3576,$B27)","v":0},{"$f":"SUMIFS('Lista pracowników'!$A$5:$A$3576,'Lista pracowników'!$G$5:$G$3576,K$4,'Lista pracowników'!$B$5:$B$3576,$B27)","v":0},{"$f":"SUMIFS('Lista pracowników'!$A$5:$A$3576,'Lista pracowników'!$G$5:$G$3576,L$4,'Lista pracowników'!$B$5:$B$3576,$B27)","v":0},{"$f":"SUMIFS('Lista pracowników'!$A$5:$A$3576,'Lista pracowników'!$G$5:$G$3576,M$4,'Lista pracowników'!$B$5:$B$3576,$B27)","v":0},{"$f":"SUMIFS('Lista pracowników'!$A$5:$A$3576,'Lista pracowników'!$G$5:$G$3576,N$4,'Lista pracowników'!$B$5:$B$3576,$B27)","v":0},null,{"$f":"IFERROR(((SUMIFS('Lista pracowników'!$A$5:$A$3576,'Lista pracowników'!$G$5:$G$3576,P$4,'Lista pracowników'!$B$5:$B$3576,$B27))/SUM($I27:$N27)),\"-\")","v":"-"},{"$f":"IFERROR(((SUMIFS('Lista pracowników'!$A$5:$A$3576,'Lista pracowników'!$G$5:$G$3576,Q$4,'Lista pracowników'!$B$5:$B$3576,$B27))/SUM($I27:$N27)),\"-\")","v":"-"},{"$f":"IFERROR(((SUMIFS('Lista pracowników'!$A$5:$A$3576,'Lista pracowników'!$G$5:$G$3576,R$4,'Lista pracowników'!$B$5:$B$3576,$B27))/(SUM($I27:$N27))),\"-\")","v":"-"},{"$f":"IFERROR(((SUMIFS('Lista pracowników'!$A$5:$A$3576,'Lista pracowników'!$G$5:$G$3576,S$4,'Lista pracowników'!$B$5:$B$3576,$B27))/SUM($I27:$N27)),\"-\")","v":"-"},{"$f":"IFERROR(((SUMIFS('Lista pracowników'!$A$5:$A$3576,'Lista pracowników'!$G$5:$G$3576,T$4,'Lista pracowników'!$B$5:$B$3576,$B27))/SUM($I27:$N27)),\"-\")","v":"-"},{"$f":"IFERROR(((SUMIFS('Lista pracowników'!$A$5:$A$3576,'Lista pracowników'!$G$5:$G$3576,U$4,'Lista pracowników'!$B$5:$B$3576,$B27))/SUM($I27:$N27)),\"-\")","v":"-"}]
[23,null,null,null,null,{"$f":"IF(E28>'Lista pracowników'!$M$4,\"-\",VLOOKUP($E28,'Siatka płac'!$B$6:$E$17,3,FALSE))","v":0},{"$f":"IF(E28>'Lista pracowników'!$M$4,\"-\",VLOOKUP($E28,'Siatka płac'!$B$6:$E$17,4,FALSE))","v":0},{"$f":"SUMIFS('Lista pracowników'!$A$5:$A$8386,'Lista pracowników'!$B$5:$B$8386,$B28)","v":0},{"$f":"SUMIFS('Lista pracowników'!$A$5:$A$3576,'Lista pracowników'!$G$5:$G$3576,I$4,'Lista pracowników'!$B$5:$B$3576,$B28)","v":0},{"$f":"SUMIFS('Lista pracowników'!$A$5:$A$3576,'Lista pracowników'!$G$5:$G$3576,J$4,'Lista pracowników'!$B$5:$B$3576,$B28)","v":0},{"$f":"SUMIFS('Lista pracowników'!$A$5:$A$3576,'Lista pracowników'!$G$5:$G$3576,K$4,'Lista pracowników'!$B$5:$B$3576,$B28)","v":0},{"$f":"SUMIFS('Lista pracowników'!$A$5:$A$3576,'Lista pracowników'!$G$5:$G$3576,L$4,'Lista pracowników'!$B$5:$B$3576,$B28)","v":0},{"$f":"SUMIFS('Lista pracowników'!$A$5:$A$3576,'Lista pracowników'!$G$5:$G$3576,M$4,'Lista pracowników'!$B$5:$B$3576,$B28)","v":0},{"$f":"SUMIFS('Lista pracowników'!$A$5:$A$3576,'Lista pracowników'!$G$5:$G$3576,N$4,'Lista pracowników'!$B$5:$B$3576,$B28)","v":0},null,{"$f":"IFERROR(((SUMIFS('Lista pracowników'!$A$5:$A$3576,'Lista pracowników'!$G$5:$G$3576,P$4,'Lista pracowników'!$B$5:$B$3576,$B28))/SUM($I28:$N28)),\"-\")","v":"-"},{"$f":"IFERROR(((SUMIFS('Lista pracowników'!$A$5:$A$3576,'Lista pracowników'!$G$5:$G$3576,Q$4,'Lista pracowników'!$B$5:$B$3576,$B28))/SUM($I28:$N28)),\"-\")","v":"-"},{"$f":"IFERROR(((SUMIFS('Lista pracowników'!$A$5:$A$3576,'Lista pracowników'!$G$5:$G$3576,R$4,'Lista pracowników'!$B$5:$B$3576,$B28))/(SUM($I28:$N28))),\"-\")","v":"-"},{"$f":"IFERROR(((SUMIFS('Lista pracowników'!$A$5:$A$3576,'Lista pracowników'!$G$5:$G$3576,S$4,'Lista pracowników'!$B$5:$B$3576,$B28))/SUM($I28:$N28)),\"-\")","v":"-"},{"$f":"IFERROR(((SUMIFS('Lista pracowników'!$A$5:$A$3576,'Lista pracowników'!$G$5:$G$3576,T$4,'Lista pracowników'!$B$5:$B$3576,$B28))/SUM($I28:$N28)),\"-\")","v":"-"},{"$f":"IFERROR(((SUMIFS('Lista pracowników'!$A$5:$A$3576,'Lista pracowników'!$G$5:$G$3576,U$4,'Lista pracowników'!$B$5:$B$3576,$B28))/SUM($I28:$N28)),\"-\")","v":"-"}]
[24,null,null,null,null,{"$f":"IF(E29>'Lista pracowników'!$M$4,\"-\",VLOOKUP($E29,'Siatka płac'!$B$6:$E$17,3,FALSE))","v":0},{"$f":"IF(E29>'Lista pracowników'!$M$4,\"-\",VLOOKUP($E29,'Siatka płac'!$B$6:$E$17,4,FALSE))","v":0},{"$f":"SUMIFS('Lista pracowników'!$A$5:$A$8386,'Lista pracowników'!$B$5:$B$8386,$B29)","v":0},{"$f":"SUMIFS('Lista pracowników'!$A$5:$A$3576,'Lista pracowników'!$G$5:$G$3576,I$4,'Lista pracowników'!$B$5:$B$3576,$B29)","v":0},{"$f":"SUMIFS('Lista pracowników'!$A$5:$A$3576,'Lista pracowników'!$G$5:$G$3576,J$4,'Lista pracowników'!$B$5:$B$3576,$B29)","v":0},{"$f":"SUMIFS('Lista pracowników'!$A$5:$A$3576,'Lista pracowników'!$G$5:$G$3576,K$4,'Lista pracowników'!$B$5:$B$3576,$B29)","v":0},{"$f":"SUMIFS('Lista pracowników'!$A$5:$A$3576,'Lista pracowników'!$G$5:$G$3576,L$4,'Lista pracowników'!$B$5:$B$3576,$B29)","v":0},{"$f":"SUMIFS('Lista pracowników'!$A$5:$A$3576,'Lista pracowników'!$G$5:$G$3576,M$4,'Lista pracowników'!$B$5:$B$3576,$B29)","v":0},{"$f":"SUMIFS('Lista pracowników'!$A$5:$A$3576,'Lista pracowników'!$G$5:$G$3576,N$4,'Lista pracowników'!$B$5:$B$3576,$B29)","v":0},null,{"$f":"IFERROR(((SUMIFS('Lista pracowników'!$A$5:$A$3576,'Lista pracowników'!$G$5:$G$3576,P$4,'Lista pracowników'!$B$5:$B$3576,$B29))/SUM($I29:$N29)),\"-\")","v":"-"},{"$f":"IFERROR(((SUMIFS('Lista pracowników'!$A$5:$A$3576,'Lista pracowników'!$G$5:$G$3576,Q$4,'Lista pracowników'!$B$5:$B$3576,$B29))/SUM($I29:$N29)),\"-\")","v":"-"},{"$f":"IFERROR(((SUMIFS('Lista pracowników'!$A$5:$A$3576,'Lista pracowników'!$G$5:$G$3576,R$4,'Lista pracowników'!$B$5:$B$3576,$B29))/(SUM($I29:$N29))),\"-\")","v":"-"},{"$f":"IFERROR(((SUMIFS('Lista pracowników'!$A$5:$A$3576,'Lista pracowników'!$G$5:$G$3576,S$4,'Lista pracowników'!$B$5:$B$3576,$B29))/SUM($I29:$N29)),\"-\")","v":"-"},{"$f":"IFERROR(((SUMIFS('Lista pracowników'!$A$5:$A$3576,'Lista pracowników'!$G$5:$G$3576,T$4,'Lista pracowników'!$B$5:$B$3576,$B29))/SUM($I29:$N29)),\"-\")","v":"-"},{"$f":"IFERROR(((SUMIFS('Lista pracowników'!$A$5:$A$3576,'Lista pracowników'!$G$5:$G$3576,U$4,'Lista pracowników'!$B$5:$B$3576,$B29))/SUM($I29:$N29)),\"-\")","v":"-"}]
[25,null,null,null,null,{"$f":"IF(E30>'Lista pracowników'!$M$4,\"-\",VLOOKUP($E30,'Siatka płac'!$B$6:$E$17,3,FALSE))","v":0},{"$f":"IF(E30>'Lista pracowników'!$M$4,\"-\",VLOOKUP($E30,'Siatka płac'!$B$6:$E$17,4,FALSE))","v":0},{"$f":"SUMIFS('Lista pracowników'!$A$5:$A$8386,'Lista pracowników'!$B$5:$B$8386,$B30)","v":0},{"$f":"SUMIFS('Lista pracowników'!$A$5:$A$3576,'Lista pracowników'!$G$5:$G$3576,I$4,'Lista pracowników'!$B$5:$B$3576,$B30)","v":0},{"$f":"SUMIFS('Lista pracowników'!$A$5:$A$3576,'Lista pracowników'!$G$5:$G$3576,J$4,'Lista pracowników'!$B$5:$B$3576,$B30)","v":0},{"$f":"SUMIFS('Lista pracowników'!$A$5:$A$3576,'Lista pracowników'!$G$5:$G$3576,K$4,'Lista pracowników'!$B$5:$B$3576,$B30)","v":0},{"$f":"SUMIFS('Lista pracowników'!$A$5:$A$3576,'Lista pracowników'!$G$5:$G$3576,L$4,'Lista pracowników'!$B$5:$B$3576,$B30)","v":0},{"$f":"SUMIFS('Lista pracowników'!$A$5:$A$3576,'Lista pracowników'!$G$5:$G$3576,M$4,'Lista pracowników'!$B$5:$B$3576,$B30)","v":0},{"$f":"SUMIFS('Lista pracowników'!$A$5:$A$3576,'Lista pracowników'!$G$5:$G$3576,N$4,'Lista pracowników'!$B$5:$B$3576,$B30)","v":0},null,{"$f":"IFERROR(((SUMIFS('Lista pracowników'!$A$5:$A$3576,'Lista pracowników'!$G$5:$G$3576,P$4,'Lista pracowników'!$B$5:$B$3576,$B30))/SUM($I30:$N30)),\"-\")","v":"-"},{"$f":"IFERROR(((SUMIFS('Lista pracowników'!$A$5:$A$3576,'Lista pracowników'!$G$5:$G$3576,Q$4,'Lista pracowników'!$B$5:$B$3576,$B30))/SUM($I30:$N30)),\"-\")","v":"-"},{"$f":"IFERROR(((SUMIFS('Lista pracowników'!$A$5:$A$3576,'Lista pracowników'!$G$5:$G$3576,R$4,'Lista pracowników'!$B$5:$B$3576,$B30))/(SUM($I30:$N30))),\"-\")","v":"-"},{"$f":"IFERROR(((SUMIFS('Lista pracowników'!$A$5:$A$3576,'Lista pracowników'!$G$5:$G$3576,S$4,'Lista pracowników'!$B$5:$B$3576,$B30))/SUM($I30:$N30)),\"-\")","v":"-"},{"$f":"IFERROR(((SUMIFS('Lista pracowników'!$A$5:$A$3576,'Lista pracowników'!$G$5:$G$3576,T$4,'Lista pracowników'!$B$5:$B$3576,$B30))/SUM($I30:$N30)),\"-\")","v":"-"},{"$f":"IFERROR(((SUMIFS('Lista pracowników'!$A$5:$A$3576,'Lista pracowników'!$G$5:$G$3576,U$4,'Lista pracowników'!$B$5:$B$3576,$B30))/SUM($I30:$N30)),\"-\")","v":"-"}]
[26,null,null,null,null,{"$f":"IF(E31>'Lista pracowników'!$M$4,\"-\",VLOOKUP($E31,'Siatka płac'!$B$6:$E$17,3,FALSE))","v":0},{"$f":"IF(E31>'Lista pracowników'!$M$4,\"-\",VLOOKUP($E31,'Siatka płac'!$B$6:$E$17,4,FALSE))","v":0},{"$f":"SUMIFS('Lista pracowników'!$A$5:$A$8386,'Lista pracowników'!$B$5:$B$8386,$B31)","v":0},{"$f":"SUMIFS('Lista pracowników'!$A$5:$A$3576,'Lista pracowników'!$G$5:$G$3576,I$4,'Lista pracowników'!$B$5:$B$3576,$B31)","v":0},{"$f":"SUMIFS('Lista pracowników'!$A$5:$A$3576,'Lista pracowników'!$G$5:$G$3576,J$4,'Lista pracowników'!$B$5:$B$3576,$B31)","v":0},{"$f":"SUMIFS('Lista pracowników'!$A$5:$A$3576,'Lista pracowników'!$G$5:$G$3576,K$4,'Lista pracowników'!$B$5:$B$3576,$B31)","v":0},{"$f":"SUMIFS('Lista pracowników'!$A$5:$A$3576,'Lista pracowników'!$G$5:$G$3576,L$4,'Lista pracowników'!$B$5:$B$3576,$B31)","v":0},{"$f":"SUMIFS('Lista pracowników'!$A$5:$A$3576,'Lista pracowników'!$G$5:$G$3576,M$4,'Lista pracowników'!$B$5:$B$3576,$B31)","v":0},{"$f":"SUMIFS('Lista pracowników'!$A$5:$A$3576,'Lista pracowników'!$G$5:$G$3576,N$4,'Lista pracowników'!$B$5:$B$3576,$B31)","v":0},null,{"$f":"IFERROR(((SUMIFS('Lista pracowników'!$A$5:$A$3576,'Lista pracowników'!$G$5:$G$3576,P$4,'Lista pracowników'!$B$5:$B$3576,$B31))/SUM($I31:$N31)),\"-\")","v":"-"},{"$f":"IFERROR(((SUMIFS('Lista pracowników'!$A$5:$A$3576,'Lista pracowników'!$G$5:$G$3576,Q$4,'Lista pracowników'!$B$5:$B$3576,$B31))/SUM($I31:$N31)),\"-\")","v":"-"},{"$f":"IFERROR(((SUMIFS('Lista pracowników'!$A$5:$A$3576,'Lista pracowników'!$G$5:$G$3576,R$4,'Lista pracowników'!$B$5:$B$3576,$B31))/(SUM($I31:$N31))),\"-\")","v":"-"},{"$f":"IFERROR(((SUMIFS('Lista pracowników'!$A$5:$A$3576,'Lista pracowników'!$G$5:$G$3576,S$4,'Lista pracowników'!$B$5:$B$3576,$B31))/SUM($I31:$N31)),\"-\")","v":"-"},{"$f":"IFERROR(((SUMIFS('Lista pracowników'!$A$5:$A$3576,'Lista pracowników'!$G$5:$G$3576,T$4,'Lista pracowników'!$B$5:$B$3576,$B31))/SUM($I31:$N31)),\"-\")","v":"-"},{"$f":"IFERROR(((SUMIFS('Lista pracowników'!$A$5:$A$3576,'Lista pracowników'!$G$5:$G$3576,U$4,'Lista pracowników'!$B$5:$B$3576,$B31))/SUM($I31:$N31)),\"-\")","v":"-"}]
[27,null,null,null,null,{"$f":"IF(E32>'Lista pracowników'!$M$4,\"-\",VLOOKUP($E32,'Siatka płac'!$B$6:$E$17,3,FALSE))","v":0},{"$f":"IF(E32>'Lista pracowników'!$M$4,\"-\",VLOOKUP($E32,'Siatka płac'!$B$6:$E$17,4,FALSE))","v":0},{"$f":"SUMIFS('Lista pracowników'!$A$5:$A$8386,'Lista pracowników'!$B$5:$B$8386,$B32)","v":0},{"$f":"SUMIFS('Lista pracowników'!$A$5:$A$3576,'Lista pracowników'!$G$5:$G$3576,I$4,'Lista pracowników'!$B$5:$B$3576,$B32)","v":0},{"$f":"SUMIFS('Lista pracowników'!$A$5:$A$3576,'Lista pracowników'!$G$5:$G$3576,J$4,'Lista pracowników'!$B$5:$B$3576,$B32)","v":0},{"$f":"SUMIFS('Lista pracowników'!$A$5:$A$3576,'Lista pracowników'!$G$5:$G$3576,K$4,'Lista pracowników'!$B$5:$B$3576,$B32)","v":0},{"$f":"SUMIFS('Lista pracowników'!$A$5:$A$3576,'Lista pracowników'!$G$5:$G$3576,L$4,'Lista pracowników'!$B$5:$B$3576,$B32)","v":0},{"$f":"SUMIFS('Lista pracowników'!$A$5:$A$3576,'Lista pracowników'!$G$5:$G$3576,M$4,'Lista pracowników'!$B$5:$B$3576,$B32)","v":0},{"$f":"SUMIFS('Lista pracowników'!$A$5:$A$3576,'Lista pracowników'!$G$5:$G$3576,N$4,'Lista pracowników'!$B$5:$B$3576,$B32)","v":0},null,{"$f":"IFERROR(((SUMIFS('Lista pracowników'!$A$5:$A$3576,'Lista pracowników'!$G$5:$G$3576,P$4,'Lista pracowników'!$B$5:$B$3576,$B32))/SUM($I32:$N32)),\"-\")","v":"-"},{"$f":"IFERROR(((SUMIFS('Lista pracowników'!$A$5:$A$3576,'Lista pracowników'!$G$5:$G$3576,Q$4,'Lista pracowników'!$B$5:$B$3576,$B32))/SUM($I32:$N32)),\"-\")","v":"-"},{"$f":"IFERROR(((SUMIFS('Lista pracowników'!$A$5:$A$3576,'Lista pracowników'!$G$5:$G$3576,R$4,'Lista pracowników'!$B$5:$B$3576,$B32))/(SUM($I32:$N32))),\"-\")","v":"-"},{"$f":"IFERROR(((SUMIFS('Lista pracowników'!$A$5:$A$3576,'Lista pracowników'!$G$5:$G$3576,S$4,'Lista pracowników'!$B$5:$B$3576,$B32))/SUM($I32:$N32)),\"-\")","v":"-"},{"$f":"IFERROR(((SUMIFS('Lista pracowników'!$A$5:$A$3576,'Lista pracowników'!$G$5:$G$3576,T$4,'Lista pracowników'!$B$5:$B$3576,$B32))/SUM($I32:$N32)),\"-\")","v":"-"},{"$f":"IFERROR(((SUMIFS('Lista pracowników'!$A$5:$A$3576,'Lista pracowników'!$G$5:$G$3576,U$4,'Lista pracowników'!$B$5:$B$3576,$B32))/SUM($I32:$N32)),\"-\")","v":"-"}]
[28,null,null,null,null,{"$f":"IF(E33>'Lista pracowników'!$M$4,\"-\",VLOOKUP($E33,'Siatka płac'!$B$6:$E$17,3,FALSE))","v":0},{"$f":"IF(E33>'Lista pracowników'!$M$4,\"-\",VLOOKUP($E33,'Siatka płac'!$B$6:$E$17,4,FALSE))","v":0},{"$f":"SUMIFS('Lista pracowników'!$A$5:$A$8386,'Lista pracowników'!$B$5:$B$8386,$B33)","v":0},{"$f":"SUMIFS('Lista pracowników'!$A$5:$A$3576,'Lista pracowników'!$G$5:$G$3576,I$4,'Lista pracowników'!$B$5:$B$3576,$B33)","v":0},{"$f":"SUMIFS('Lista pracowników'!$A$5:$A$3576,'Lista pracowników'!$G$5:$G$3576,J$4,'Lista pracowników'!$B$5:$B$3576,$B33)","v":0},{"$f":"SUMIFS('Lista pracowników'!$A$5:$A$3576,'Lista pracowników'!$G$5:$G$3576,K$4,'Lista pracowników'!$B$5:$B$3576,$B33)","v":0},{"$f":"SUMIFS('Lista pracowników'!$A$5:$A$3576,'Lista pracowników'!$G$5:$G$3576,L$4,'Lista pracowników'!$B$5:$B$3576,$B33)","v":0},{"$f":"SUMIFS('Lista pracowników'!$A$5:$A$3576,'Lista pracowników'!$G$5:$G$3576,M$4,'Lista pracowników'!$B$5:$B$3576,$B33)","v":0},{"$f":"SUMIFS('Lista pracowników'!$A$5:$A$3576,'Lista pracowników'!$G$5:$G$3576,N$4,'Lista pracowników'!$B$5:$B$3576,$B33)","v":0},null,{"$f":"IFERROR(((SUMIFS('Lista pracowników'!$A$5:$A$3576,'Lista pracowników'!$G$5:$G$3576,P$4,'Lista pracowników'!$B$5:$B$3576,$B33))/SUM($I33:$N33)),\"-\")","v":"-"},{"$f":"IFERROR(((SUMIFS('Lista pracowników'!$A$5:$A$3576,'Lista pracowników'!$G$5:$G$3576,Q$4,'Lista pracowników'!$B$5:$B$3576,$B33))/SUM($I33:$N33)),\"-\")","v":"-"},{"$f":"IFERROR(((SUMIFS('Lista pracowników'!$A$5:$A$3576,'Lista pracowników'!$G$5:$G$3576,R$4,'Lista pracowników'!$B$5:$B$3576,$B33))/(SUM($I33:$N33))),\"-\")","v":"-"},{"$f":"IFERROR(((SUMIFS('Lista pracowników'!$A$5:$A$3576,'Lista pracowników'!$G$5:$G$3576,S$4,'Lista pracowników'!$B$5:$B$3576,$B33))/SUM($I33:$N33)),\"-\")","v":"-"},{"$f":"IFERROR(((SUMIFS('Lista pracowników'!$A$5:$A$3576,'Lista pracowników'!$G$5:$G$3576,T$4,'Lista pracowników'!$B$5:$B$3576,$B33))/SUM($I33:$N33)),\"-\")","v":"-"},{"$f":"IFERROR(((SUMIFS('Lista pracowników'!$A$5:$A$3576,'Lista pracowników'!$G$5:$G$3576,U$4,'Lista pracowników'!$B$5:$B$3576,$B33))/SUM($I33:$N33)),\"-\")","v":"-"}]
[29,null,null,null,null,{"$f":"IF(E34>'Lista pracowników'!$M$4,\"-\",VLOOKUP($E34,'Siatka płac'!$B$6:$E$17,3,FALSE))","v":0},{"$f":"IF(E34>'Lista pracowników'!$M$4,\"-\",VLOOKUP($E34,'Siatka płac'!$B$6:$E$17,4,FALSE))","v":0},{"$f":"SUMIFS('Lista pracowników'!$A$5:$A$8386,'Lista pracowników'!$B$5:$B$8386,$B34)","v":0},{"$f":"SUMIFS('Lista pracowników'!$A$5:$A$3576,'Lista pracowników'!$G$5:$G$3576,I$4,'Lista pracowników'!$B$5:$B$3576,$B34)","v":0},{"$f":"SUMIFS('Lista pracowników'!$A$5:$A$3576,'Lista pracowników'!$G$5:$G$3576,J$4,'Lista pracowników'!$B$5:$B$3576,$B34)","v":0},{"$f":"SUMIFS('Lista pracowników'!$A$5:$A$3576,'Lista pracowników'!$G$5:$G$3576,K$4,'Lista pracowników'!$B$5:$B$3576,$B34)","v":0},{"$f":"SUMIFS('Lista pracowników'!$A$5:$A$3576,'Lista pracowników'!$G$5:$G$3576,L$4,'Lista pracowników'!$B$5:$B$3576,$B34)","v":0},{"$f":"SUMIFS('Lista pracowników'!$A$5:$A$3576,'Lista pracowników'!$G$5:$G$3576,M$4,'Lista pracowników'!$B$5:$B$3576,$B34)","v":0},{"$f":"SUMIFS('Lista pracowników'!$A$5:$A$3576,'Lista pracowników'!$G$5:$G$3576,N$4,'Lista pracowników'!$B$5:$B$3576,$B34)","v":0},null,{"$f":"IFERROR(((SUMIFS('Lista pracowników'!$A$5:$A$3576,'Lista pracowników'!$G$5:$G$3576,P$4,'Lista pracowników'!$B$5:$B$3576,$B34))/SUM($I34:$N34)),\"-\")","v":"-"},{"$f":"IFERROR(((SUMIFS('Lista pracowników'!$A$5:$A$3576,'Lista pracowników'!$G$5:$G$3576,Q$4,'Lista pracowników'!$B$5:$B$3576,$B34))/SUM($I34:$N34)),\"-\")","v":"-"},{"$f":"IFERROR(((SUMIFS('Lista pracowników'!$A$5:$A$3576,'Lista pracowników'!$G$5:$G$3576,R$4,'Lista pracowników'!$B$5:$B$3576,$B34))/(SUM($I34:$N34))),\"-\")","v":"-"},{"$f":"IFERROR(((SUMIFS('Lista pracowników'!$A$5:$A$3576,'Lista pracowników'!$G$5:$G$3576,S$4,'Lista pracowników'!$B$5:$B$3576,$B34))/SUM($I34:$N34)),\"-\")","v":"-"},{"$f":"IFERROR(((SUMIFS('Lista pracowników'!$A$5:$A$3576,'Lista pracowników'!$G$5:$G$3576,T$4,'Lista pracowników'!$B$5:$B$3576,$B34))/SUM($I34:$N34)),\"-\")","v":"-"},{"$f":"IFERROR(((SUMIFS('Lista pracowników'!$A$5:$A$3576,'Lista pracowników'!$G$5:$G$3576,U$4,'Lista pracowników'!$B$5:$B$3576,$B34))/SUM($I34:$N34)),\"-\")","v":"-"}]
[30,null,null,null,null,{"$f":"IF(E35>'Lista pracowników'!$M$4,\"-\",VLOOKUP($E35,'Siatka płac'!$B$6:$E$17,3,FALSE))","v":0},{"$f":"IF(E35>'Lista pracowników'!$M$4,\"-\",VLOOKUP($E35,'Siatka płac'!$B$6:$E$17,4,FALSE))","v":0},{"$f":"SUMIFS('Lista pracowników'!$A$5:$A$8386,'Lista pracowników'!$B$5:$B$8386,$B35)","v":0},{"$f":"SUMIFS('Lista pracowników'!$A$5:$A$3576,'Lista pracowników'!$G$5:$G$3576,I$4,'Lista pracowników'!$B$5:$B$3576,$B35)","v":0},{"$f":"SUMIFS('Lista pracowników'!$A$5:$A$3576,'Lista pracowników'!$G$5:$G$3576,J$4,'Lista pracowników'!$B$5:$B$3576,$B35)","v":0},{"$f":"SUMIFS('Lista pracowników'!$A$5:$A$3576,'Lista pracowników'!$G$5:$G$3576,K$4,'Lista pracowników'!$B$5:$B$3576,$B35)","v":0},{"$f":"SUMIFS('Lista pracowników'!$A$5:$A$3576,'Lista pracowników'!$G$5:$G$3576,L$4,'Lista pracowników'!$B$5:$B$3576,$B35)","v":0},{"$f":"SUMIFS('Lista pracowników'!$A$5:$A$3576,'Lista pracowników'!$G$5:$G$3576,M$4,'Lista pracowników'!$B$5:$B$3576,$B35)","v":0},{"$f":"SUMIFS('Lista pracowników'!$A$5:$A$3576,'Lista pracowników'!$G$5:$G$3576,N$4,'Lista pracowników'!$B$5:$B$3576,$B35)","v":0},null,{"$f":"IFERROR(((SUMIFS('Lista pracowników'!$A$5:$A$3576,'Lista pracowników'!$G$5:$G$3576,P$4,'Lista pracowników'!$B$5:$B$3576,$B35))/SUM($I35:$N35)),\"-\")","v":"-"},{"$f":"IFERROR(((SUMIFS('Lista pracowników'!$A$5:$A$3576,'Lista pracowników'!$G$5:$G$3576,Q$4,'Lista pracowników'!$B$5:$B$3576,$B35))/SUM($I35:$N35)),\"-\")","v":"-"},{"$f":"IFERROR(((SUMIFS('Lista pracowników'!$A$5:$A$3576,'Lista pracowników'!$G$5:$G$3576,R$4,'Lista pracowników'!$B$5:$B$3576,$B35))/(SUM($I35:$N35))),\"-\")","v":"-"},{"$f":"IFERROR(((SUMIFS('Lista pracowników'!$A$5:$A$3576,'Lista pracowników'!$G$5:$G$3576,S$4,'Lista pracowników'!$B$5:$B$3576,$B35))/SUM($I35:$N35)),\"-\")","v":"-"},{"$f":"IFERROR(((SUMIFS('Lista pracowników'!$A$5:$A$3576,'Lista pracowników'!$G$5:$G$3576,T$4,'Lista pracowników'!$B$5:$B$3576,$B35))/SUM($I35:$N35)),\"-\")","v":"-"},{"$f":"IFERROR(((SUMIFS('Lista pracowników'!$A$5:$A$3576,'Lista pracowników'!$G$5:$G$3576,U$4,'Lista pracowników'!$B$5:$B$3576,$B35))/SUM($I35:$N35)),\"-\")","v":"-"}]
[31,null,null,null,null,{"$f":"IF(E36>'Lista pracowników'!$M$4,\"-\",VLOOKUP($E36,'Siatka płac'!$B$6:$E$17,3,FALSE))","v":0},{"$f":"IF(E36>'Lista pracowników'!$M$4,\"-\",VLOOKUP($E36,'Siatka płac'!$B$6:$E$17,4,FALSE))","v":0},{"$f":"SUMIFS('Lista pracowników'!$A$5:$A$8386,'Lista pracowników'!$B$5:$B$8386,$B36)","v":0},{"$f":"SUMIFS('Lista pracowników'!$A$5:$A$3576,'Lista pracowników'!$G$5:$G$3576,I$4,'Lista pracowników'!$B$5:$B$3576,$B36)","v":0},{"$f":"SUMIFS('Lista pracowników'!$A$5:$A$3576,'Lista pracowników'!$G$5:$G$3576,J$4,'Lista pracowników'!$B$5:$B$3576,$B36)","v":0},{"$f":"SUMIFS('Lista pracowników'!$A$5:$A$3576,'Lista pracowników'!$G$5:$G$3576,K$4,'Lista pracowników'!$B$5:$B$3576,$B36)","v":0},{"$f":"SUMIFS('Lista pracowników'!$A$5:$A$3576,'Lista pracowników'!$G$5:$G$3576,L$4,'Lista pracowników'!$B$5:$B$3576,$B36)","v":0},{"$f":"SUMIFS('Lista pracowników'!$A$5:$A$3576,'Lista pracowników'!$G$5:$G$3576,M$4,'Lista pracowników'!$B$5:$B$3576,$B36)","v":0},{"$f":"SUMIFS('Lista pracowników'!$A$5:$A$3576,'Lista pracowników'!$G$5:$G$3576,N$4,'Lista pracowników'!$B$5:$B$3576,$B36)","v":0},null,{"$f":"IFERROR(((SUMIFS('Lista pracowników'!$A$5:$A$3576,'Lista pracowników'!$G$5:$G$3576,P$4,'Lista pracowników'!$B$5:$B$3576,$B36))/SUM($I36:$N36)),\"-\")","v":"-"},{"$f":"IFERROR(((SUMIFS('Lista pracowników'!$A$5:$A$3576,'Lista pracowników'!$G$5:$G$3576,Q$4,'Lista pracowników'!$B$5:$B$3576,$B36))/SUM($I36:$N36)),\"-\")","v":"-"},{"$f":"IFERROR(((SUMIFS('Lista pracowników'!$A$5:$A$3576,'Lista pracowników'!$G$5:$G$3576,R$4,'Lista pracowników'!$B$5:$B$3576,$B36))/(SUM($I36:$N36))),\"-\")","v":"-"},{"$f":"IFERROR(((SUMIFS('Lista pracowników'!$A$5:$A$3576,'Lista pracowników'!$G$5:$G$3576,S$4,'Lista pracowników'!$B$5:$B$3576,$B36))/SUM($I36:$N36)),\"-\")","v":"-"},{"$f":"IFERROR(((SUMIFS('Lista pracowników'!$A$5:$A$3576,'Lista pracowników'!$G$5:$G$3576,T$4,'Lista pracowników'!$B$5:$B$3576,$B36))/SUM($I36:$N36)),\"-\")","v":"-"},{"$f":"IFERROR(((SUMIFS('Lista pracowników'!$A$5:$A$3576,'Lista pracowników'!$G$5:$G$3576,U$4,'Lista pracowników'!$B$5:$B$3576,$B36))/SUM($I36:$N36)),\"-\")","v":"-"}]
[32,null,null,null,null,{"$f":"IF(E37>'Lista pracowników'!$M$4,\"-\",VLOOKUP($E37,'Siatka płac'!$B$6:$E$17,3,FALSE))","v":0},{"$f":"IF(E37>'Lista pracowników'!$M$4,\"-\",VLOOKUP($E37,'Siatka płac'!$B$6:$E$17,4,FALSE))","v":0},{"$f":"SUMIFS('Lista pracowników'!$A$5:$A$8386,'Lista pracowników'!$B$5:$B$8386,$B37)","v":0},{"$f":"SUMIFS('Lista pracowników'!$A$5:$A$3576,'Lista pracowników'!$G$5:$G$3576,I$4,'Lista pracowników'!$B$5:$B$3576,$B37)","v":0},{"$f":"SUMIFS('Lista pracowników'!$A$5:$A$3576,'Lista pracowników'!$G$5:$G$3576,J$4,'Lista pracowników'!$B$5:$B$3576,$B37)","v":0},{"$f":"SUMIFS('Lista pracowników'!$A$5:$A$3576,'Lista pracowników'!$G$5:$G$3576,K$4,'Lista pracowników'!$B$5:$B$3576,$B37)","v":0},{"$f":"SUMIFS('Lista pracowników'!$A$5:$A$3576,'Lista pracowników'!$G$5:$G$3576,L$4,'Lista pracowników'!$B$5:$B$3576,$B37)","v":0},{"$f":"SUMIFS('Lista pracowników'!$A$5:$A$3576,'Lista pracowników'!$G$5:$G$3576,M$4,'Lista pracowników'!$B$5:$B$3576,$B37)","v":0},{"$f":"SUMIFS('Lista pracowników'!$A$5:$A$3576,'Lista pracowników'!$G$5:$G$3576,N$4,'Lista pracowników'!$B$5:$B$3576,$B37)","v":0},null,{"$f":"IFERROR(((SUMIFS('Lista pracowników'!$A$5:$A$3576,'Lista pracowników'!$G$5:$G$3576,P$4,'Lista pracowników'!$B$5:$B$3576,$B37))/SUM($I37:$N37)),\"-\")","v":"-"},{"$f":"IFERROR(((SUMIFS('Lista pracowników'!$A$5:$A$3576,'Lista pracowników'!$G$5:$G$3576,Q$4,'Lista pracowników'!$B$5:$B$3576,$B37))/SUM($I37:$N37)),\"-\")","v":"-"},{"$f":"IFERROR(((SUMIFS('Lista pracowników'!$A$5:$A$3576,'Lista pracowników'!$G$5:$G$3576,R$4,'Lista pracowników'!$B$5:$B$3576,$B37))/(SUM($I37:$N37))),\"-\")","v":"-"},{"$f":"IFERROR(((SUMIFS('Lista pracowników'!$A$5:$A$3576,'Lista pracowników'!$G$5:$G$3576,S$4,'Lista pracowników'!$B$5:$B$3576,$B37))/SUM($I37:$N37)),\"-\")","v":"-"},{"$f":"IFERROR(((SUMIFS('Lista pracowników'!$A$5:$A$3576,'Lista pracowników'!$G$5:$G$3576,T$4,'Lista pracowników'!$B$5:$B$3576,$B37))/SUM($I37:$N37)),\"-\")","v":"-"},{"$f":"IFERROR(((SUMIFS('Lista pracowników'!$A$5:$A$3576,'Lista pracowników'!$G$5:$G$3576,U$4,'Lista pracowników'!$B$5:$B$3576,$B37))/SUM($I37:$N37)),\"-\")","v":"-"}]
[33,null,null,null,null,{"$f":"IF(E38>'Lista pracowników'!$M$4,\"-\",VLOOKUP($E38,'Siatka płac'!$B$6:$E$17,3,FALSE))","v":0},{"$f":"IF(E38>'Lista pracowników'!$M$4,\"-\",VLOOKUP($E38,'Siatka płac'!$B$6:$E$17,4,FALSE))","v":0},{"$f":"SUMIFS('Lista pracowników'!$A$5:$A$8386,'Lista pracowników'!$B$5:$B$8386,$B38)","v":0},{"$f":"SUMIFS('Lista pracowników'!$A$5:$A$3576,'Lista pracowników'!$G$5:$G$3576,I$4,'Lista pracowników'!$B$5:$B$3576,$B38)","v":0},{"$f":"SUMIFS('Lista pracowników'!$A$5:$A$3576,'Lista pracowników'!$G$5:$G$3576,J$4,'Lista pracowników'!$B$5:$B$3576,$B38)","v":0},{"$f":"SUMIFS('Lista pracowników'!$A$5:$A$3576,'Lista pracowników'!$G$5:$G$3576,K$4,'Lista pracowników'!$B$5:$B$3576,$B38)","v":0},{"$f":"SUMIFS('Lista pracowników'!$A$5:$A$3576,'Lista pracowników'!$G$5:$G$3576,L$4,'Lista pracowników'!$B$5:$B$3576,$B38)","v":0},{"$f":"SUMIFS('Lista pracowników'!$A$5:$A$3576,'Lista pracowników'!$G$5:$G$3576,M$4,'Lista pracowników'!$B$5:$B$3576,$B38)","v":0},{"$f":"SUMIFS('Lista pracowników'!$A$5:$A$3576,'Lista pracowników'!$G$5:$G$3576,N$4,'Lista pracowników'!$B$5:$B$3576,$B38)","v":0},null,{"$f":"IFERROR(((SUMIFS('Lista pracowników'!$A$5:$A$3576,'Lista pracowników'!$G$5:$G$3576,P$4,'Lista pracowników'!$B$5:$B$3576,$B38))/SUM($I38:$N38)),\"-\")","v":"-"},{"$f":"IFERROR(((SUMIFS('Lista pracowników'!$A$5:$A$3576,'Lista pracowników'!$G$5:$G$3576,Q$4,'Lista pracowników'!$B$5:$B$3576,$B38))/SUM($I38:$N38)),\"-\")","v":"-"},{"$f":"IFERROR(((SUMIFS('Lista pracowników'!$A$5:$A$3576,'Lista pracowników'!$G$5:$G$3576,R$4,'Lista pracowników'!$B$5:$B$3576,$B38))/(SUM($I38:$N38))),\"-\")","v":"-"},{"$f":"IFERROR(((SUMIFS('Lista pracowników'!$A$5:$A$3576,'Lista pracowników'!$G$5:$G$3576,S$4,'Lista pracowników'!$B$5:$B$3576,$B38))/SUM($I38:$N38)),\"-\")","v":"-"},{"$f":"IFERROR(((SUMIFS('Lista pracowników'!$A$5:$A$3576,'Lista pracowników'!$G$5:$G$3576,T$4,'Lista pracowników'!$B$5:$B$3576,$B38))/SUM($I38:$N38)),\"-\")","v":"-"},{"$f":"IFERROR(((SUMIFS('Lista pracowników'!$A$5:$A$3576,'Lista pracowników'!$G$5:$G$3576,U$4,'Lista pracowników'!$B$5:$B$3576,$B38))/SUM($I38:$N38)),\"-\")","v":"-"}]
[34,null,null,null,null,{"$f":"IF(E39>'Lista pracowników'!$M$4,\"-\",VLOOKUP($E39,'Siatka płac'!$B$6:$E$17,3,FALSE))","v":0},{"$f":"IF(E39>'Lista pracowników'!$M$4,\"-\",VLOOKUP($E39,'Siatka płac'!$B$6:$E$17,4,FALSE))","v":0},{"$f":"SUMIFS('Lista pracowników'!$A$5:$A$8386,'Lista pracowników'!$B$5:$B$8386,$B39)","v":0},{"$f":"SUMIFS('Lista pracowników'!$A$5:$A$3576,'Lista pracowników'!$G$5:$G$3576,I$4,'Lista pracowników'!$B$5:$B$3576,$B39)","v":0},{"$f":"SUMIFS('Lista pracowników'!$A$5:$A$3576,'Lista pracowników'!$G$5:$G$3576,J$4,'Lista pracowników'!$B$5:$B$3576,$B39)","v":0},{"$f":"SUMIFS('Lista pracowników'!$A$5:$A$3576,'Lista pracowników'!$G$5:$G$3576,K$4,'Lista pracowników'!$B$5:$B$3576,$B39)","v":0},{"$f":"SUMIFS('Lista pracowników'!$A$5:$A$3576,'Lista pracowników'!$G$5:$G$3576,L$4,'Lista pracowników'!$B$5:$B$3576,$B39)","v":0},{"$f":"SUMIFS('Lista pracowników'!$A$5:$A$3576,'Lista pracowników'!$G$5:$G$3576,M$4,'Lista pracowników'!$B$5:$B$3576,$B39)","v":0},{"$f":"SUMIFS('Lista pracowników'!$A$5:$A$3576,'Lista pracowników'!$G$5:$G$3576,N$4,'Lista pracowników'!$B$5:$B$3576,$B39)","v":0},null,{"$f":"IFERROR(((SUMIFS('Lista pracowników'!$A$5:$A$3576,'Lista pracowników'!$G$5:$G$3576,P$4,'Lista pracowników'!$B$5:$B$3576,$B39))/SUM($I39:$N39)),\"-\")","v":"-"},{"$f":"IFERROR(((SUMIFS('Lista pracowników'!$A$5:$A$3576,'Lista pracowników'!$G$5:$G$3576,Q$4,'Lista pracowników'!$B$5:$B$3576,$B39))/SUM($I39:$N39)),\"-\")","v":"-"},{"$f":"IFERROR(((SUMIFS('Lista pracowników'!$A$5:$A$3576,'Lista pracowników'!$G$5:$G$3576,R$4,'Lista pracowników'!$B$5:$B$3576,$B39))/(SUM($I39:$N39))),\"-\")","v":"-"},{"$f":"IFERROR(((SUMIFS('Lista pracowników'!$A$5:$A$3576,'Lista pracowników'!$G$5:$G$3576,S$4,'Lista pracowników'!$B$5:$B$3576,$B39))/SUM($I39:$N39)),\"-\")","v":"-"},{"$f":"IFERROR(((SUMIFS('Lista pracowników'!$A$5:$A$3576,'Lista pracowników'!$G$5:$G$3576,T$4,'Lista pracowników'!$B$5:$B$3576,$B39))/SUM($I39:$N39)),\"-\")","v":"-"},{"$f":"IFERROR(((SUMIFS('Lista pracowników'!$A$5:$A$3576,'Lista pracowników'!$G$5:$G$3576,U$4,'Lista pracowników'!$B$5:$B$3576,$B39))/SUM($I39:$N39)),\"-\")","v":"-"}]
[35,null,null,null,null,{"$f":"IF(E40>'Lista pracowników'!$M$4,\"-\",VLOOKUP($E40,'Siatka płac'!$B$6:$E$17,3,FALSE))","v":0},{"$f":"IF(E40>'Lista pracowników'!$M$4,\"-\",VLOOKUP($E40,'Siatka płac'!$B$6:$E$17,4,FALSE))","v":0},{"$f":"SUMIFS('Lista pracowników'!$A$5:$A$8386,'Lista pracowników'!$B$5:$B$8386,$B40)","v":0},{"$f":"SUMIFS('Lista pracowników'!$A$5:$A$3576,'Lista pracowników'!$G$5:$G$3576,I$4,'Lista pracowników'!$B$5:$B$3576,$B40)","v":0},{"$f":"SUMIFS('Lista pracowników'!$A$5:$A$3576,'Lista pracowników'!$G$5:$G$3576,J$4,'Lista pracowników'!$B$5:$B$3576,$B40)","v":0},{"$f":"SUMIFS('Lista pracowników'!$A$5:$A$3576,'Lista pracowników'!$G$5:$G$3576,K$4,'Lista pracowników'!$B$5:$B$3576,$B40)","v":0},{"$f":"SUMIFS('Lista pracowników'!$A$5:$A$3576,'Lista pracowników'!$G$5:$G$3576,L$4,'Lista pracowników'!$B$5:$B$3576,$B40)","v":0},{"$f":"SUMIFS('Lista pracowników'!$A$5:$A$3576,'Lista pracowników'!$G$5:$G$3576,M$4,'Lista pracowników'!$B$5:$B$3576,$B40)","v":0},{"$f":"SUMIFS('Lista pracowników'!$A$5:$A$3576,'Lista pracowników'!$G$5:$G$3576,N$4,'Lista pracowników'!$B$5:$B$3576,$B40)","v":0},null,{"$f":"IFERROR(((SUMIFS('Lista pracowników'!$A$5:$A$3576,'Lista pracowników'!$G$5:$G$3576,P$4,'Lista pracowników'!$B$5:$B$3576,$B40))/SUM($I40:$N40)),\"-\")","v":"-"},{"$f":"IFERROR(((SUMIFS('Lista pracowników'!$A$5:$A$3576,'Lista pracowników'!$G$5:$G$3576,Q$4,'Lista pracowników'!$B$5:$B$3576,$B40))/SUM($I40:$N40)),\"-\")","v":"-"},{"$f":"IFERROR(((SUMIFS('Lista pracowników'!$A$5:$A$3576,'Lista pracowników'!$G$5:$G$3576,R$4,'Lista pracowników'!$B$5:$B$3576,$B40))/(SUM($I40:$N40))),\"-\")","v":"-"},{"$f":"IFERROR(((SUMIFS('Lista pracowników'!$A$5:$A$3576,'Lista pracowników'!$G$5:$G$3576,S$4,'Lista pracowników'!$B$5:$B$3576,$B40))/SUM($I40:$N40)),\"-\")","v":"-"},{"$f":"IFERROR(((SUMIFS('Lista pracowników'!$A$5:$A$3576,'Lista pracowników'!$G$5:$G$3576,T$4,'Lista pracowników'!$B$5:$B$3576,$B40))/SUM($I40:$N40)),\"-\")","v":"-"},{"$f":"IFERROR(((SUMIFS('Lista pracowników'!$A$5:$A$3576,'Lista pracowników'!$G$5:$G$3576,U$4,'Lista pracowników'!$B$5:$B$3576,$B40))/SUM($I40:$N40)),\"-\")","v":"-"}]
[36,null,null,null,null,{"$f":"IF(E41>'Lista pracowników'!$M$4,\"-\",VLOOKUP($E41,'Siatka płac'!$B$6:$E$17,3,FALSE))","v":0},{"$f":"IF(E41>'Lista pracowników'!$M$4,\"-\",VLOOKUP($E41,'Siatka płac'!$B$6:$E$17,4,FALSE))","v":0},{"$f":"SUMIFS('Lista pracowników'!$A$5:$A$8386,'Lista pracowników'!$B$5:$B$8386,$B41)","v":0},{"$f":"SUMIFS('Lista pracowników'!$A$5:$A$3576,'Lista pracowników'!$G$5:$G$3576,I$4,'Lista pracowników'!$B$5:$B$3576,$B41)","v":0},{"$f":"SUMIFS('Lista pracowników'!$A$5:$A$3576,'Lista pracowników'!$G$5:$G$3576,J$4,'Lista pracowników'!$B$5:$B$3576,$B41)","v":0},{"$f":"SUMIFS('Lista pracowników'!$A$5:$A$3576,'Lista pracowników'!$G$5:$G$3576,K$4,'Lista pracowników'!$B$5:$B$3576,$B41)","v":0},{"$f":"SUMIFS('Lista pracowników'!$A$5:$A$3576,'Lista pracowników'!$G$5:$G$3576,L$4,'Lista pracowników'!$B$5:$B$3576,$B41)","v":0},{"$f":"SUMIFS('Lista pracowników'!$A$5:$A$3576,'Lista pracowników'!$G$5:$G$3576,M$4,'Lista pracowników'!$B$5:$B$3576,$B41)","v":0},{"$f":"SUMIFS('Lista pracowników'!$A$5:$A$3576,'Lista pracowników'!$G$5:$G$3576,N$4,'Lista pracowników'!$B$5:$B$3576,$B41)","v":0},null,{"$f":"IFERROR(((SUMIFS('Lista pracowników'!$A$5:$A$3576,'Lista pracowników'!$G$5:$G$3576,P$4,'Lista pracowników'!$B$5:$B$3576,$B41))/SUM($I41:$N41)),\"-\")","v":"-"},{"$f":"IFERROR(((SUMIFS('Lista pracowników'!$A$5:$A$3576,'Lista pracowników'!$G$5:$G$3576,Q$4,'Lista pracowników'!$B$5:$B$3576,$B41))/SUM($I41:$N41)),\"-\")","v":"-"},{"$f":"IFERROR(((SUMIFS('Lista pracowników'!$A$5:$A$3576,'Lista pracowników'!$G$5:$G$3576,R$4,'Lista pracowników'!$B$5:$B$3576,$B41))/(SUM($I41:$N41))),\"-\")","v":"-"},{"$f":"IFERROR(((SUMIFS('Lista pracowników'!$A$5:$A$3576,'Lista pracowników'!$G$5:$G$3576,S$4,'Lista pracowników'!$B$5:$B$3576,$B41))/SUM($I41:$N41)),\"-\")","v":"-"},{"$f":"IFERROR(((SUMIFS('Lista pracowników'!$A$5:$A$3576,'Lista pracowników'!$G$5:$G$3576,T$4,'Lista pracowników'!$B$5:$B$3576,$B41))/SUM($I41:$N41)),\"-\")","v":"-"},{"$f":"IFERROR(((SUMIFS('Lista pracowników'!$A$5:$A$3576,'Lista pracowników'!$G$5:$G$3576,U$4,'Lista pracowników'!$B$5:$B$3576,$B41))/SUM($I41:$N41)),\"-\")","v":"-"}]
[37,null,null,null,null,{"$f":"IF(E42>'Lista pracowników'!$M$4,\"-\",VLOOKUP($E42,'Siatka płac'!$B$6:$E$17,3,FALSE))","v":0},{"$f":"IF(E42>'Lista pracowników'!$M$4,\"-\",VLOOKUP($E42,'Siatka płac'!$B$6:$E$17,4,FALSE))","v":0},{"$f":"SUMIFS('Lista pracowników'!$A$5:$A$8386,'Lista pracowników'!$B$5:$B$8386,$B42)","v":0},{"$f":"SUMIFS('Lista pracowników'!$A$5:$A$3576,'Lista pracowników'!$G$5:$G$3576,I$4,'Lista pracowników'!$B$5:$B$3576,$B42)","v":0},{"$f":"SUMIFS('Lista pracowników'!$A$5:$A$3576,'Lista pracowników'!$G$5:$G$3576,J$4,'Lista pracowników'!$B$5:$B$3576,$B42)","v":0},{"$f":"SUMIFS('Lista pracowników'!$A$5:$A$3576,'Lista pracowników'!$G$5:$G$3576,K$4,'Lista pracowników'!$B$5:$B$3576,$B42)","v":0},{"$f":"SUMIFS('Lista pracowników'!$A$5:$A$3576,'Lista pracowników'!$G$5:$G$3576,L$4,'Lista pracowników'!$B$5:$B$3576,$B42)","v":0},{"$f":"SUMIFS('Lista pracowników'!$A$5:$A$3576,'Lista pracowników'!$G$5:$G$3576,M$4,'Lista pracowników'!$B$5:$B$3576,$B42)","v":0},{"$f":"SUMIFS('Lista pracowników'!$A$5:$A$3576,'Lista pracowników'!$G$5:$G$3576,N$4,'Lista pracowników'!$B$5:$B$3576,$B42)","v":0},null,{"$f":"IFERROR(((SUMIFS('Lista pracowników'!$A$5:$A$3576,'Lista pracowników'!$G$5:$G$3576,P$4,'Lista pracowników'!$B$5:$B$3576,$B42))/SUM($I42:$N42)),\"-\")","v":"-"},{"$f":"IFERROR(((SUMIFS('Lista pracowników'!$A$5:$A$3576,'Lista pracowników'!$G$5:$G$3576,Q$4,'Lista pracowników'!$B$5:$B$3576,$B42))/SUM($I42:$N42)),\"-\")","v":"-"},{"$f":"IFERROR(((SUMIFS('Lista pracowników'!$A$5:$A$3576,'Lista pracowników'!$G$5:$G$3576,R$4,'Lista pracowników'!$B$5:$B$3576,$B42))/(SUM($I42:$N42))),\"-\")","v":"-"},{"$f":"IFERROR(((SUMIFS('Lista pracowników'!$A$5:$A$3576,'Lista pracowników'!$G$5:$G$3576,S$4,'Lista pracowników'!$B$5:$B$3576,$B42))/SUM($I42:$N42)),\"-\")","v":"-"},{"$f":"IFERROR(((SUMIFS('Lista pracowników'!$A$5:$A$3576,'Lista pracowników'!$G$5:$G$3576,T$4,'Lista pracowników'!$B$5:$B$3576,$B42))/SUM($I42:$N42)),\"-\")","v":"-"},{"$f":"IFERROR(((SUMIFS('Lista pracowników'!$A$5:$A$3576,'Lista pracowników'!$G$5:$G$3576,U$4,'Lista pracowników'!$B$5:$B$3576,$B42))/SUM($I42:$N42)),\"-\")","v":"-"}]
[38,null,null,null,null,{"$f":"IF(E43>'Lista pracowników'!$M$4,\"-\",VLOOKUP($E43,'Siatka płac'!$B$6:$E$17,3,FALSE))","v":0},{"$f":"IF(E43>'Lista pracowników'!$M$4,\"-\",VLOOKUP($E43,'Siatka płac'!$B$6:$E$17,4,FALSE))","v":0},{"$f":"SUMIFS('Lista pracowników'!$A$5:$A$8386,'Lista pracowników'!$B$5:$B$8386,$B43)","v":0},{"$f":"SUMIFS('Lista pracowników'!$A$5:$A$3576,'Lista pracowników'!$G$5:$G$3576,I$4,'Lista pracowników'!$B$5:$B$3576,$B43)","v":0},{"$f":"SUMIFS('Lista pracowników'!$A$5:$A$3576,'Lista pracowników'!$G$5:$G$3576,J$4,'Lista pracowników'!$B$5:$B$3576,$B43)","v":0},{"$f":"SUMIFS('Lista pracowników'!$A$5:$A$3576,'Lista pracowników'!$G$5:$G$3576,K$4,'Lista pracowników'!$B$5:$B$3576,$B43)","v":0},{"$f":"SUMIFS('Lista pracowników'!$A$5:$A$3576,'Lista pracowników'!$G$5:$G$3576,L$4,'Lista pracowników'!$B$5:$B$3576,$B43)","v":0},{"$f":"SUMIFS('Lista pracowników'!$A$5:$A$3576,'Lista pracowników'!$G$5:$G$3576,M$4,'Lista pracowników'!$B$5:$B$3576,$B43)","v":0},{"$f":"SUMIFS('Lista pracowników'!$A$5:$A$3576,'Lista pracowników'!$G$5:$G$3576,N$4,'Lista pracowników'!$B$5:$B$3576,$B43)","v":0},null,{"$f":"IFERROR(((SUMIFS('Lista pracowników'!$A$5:$A$3576,'Lista pracowników'!$G$5:$G$3576,P$4,'Lista pracowników'!$B$5:$B$3576,$B43))/SUM($I43:$N43)),\"-\")","v":"-"},{"$f":"IFERROR(((SUMIFS('Lista pracowników'!$A$5:$A$3576,'Lista pracowników'!$G$5:$G$3576,Q$4,'Lista pracowników'!$B$5:$B$3576,$B43))/SUM($I43:$N43)),\"-\")","v":"-"},{"$f":"IFERROR(((SUMIFS('Lista pracowników'!$A$5:$A$3576,'Lista pracowników'!$G$5:$G$3576,R$4,'Lista pracowników'!$B$5:$B$3576,$B43))/(SUM($I43:$N43))),\"-\")","v":"-"},{"$f":"IFERROR(((SUMIFS('Lista pracowników'!$A$5:$A$3576,'Lista pracowników'!$G$5:$G$3576,S$4,'Lista pracowników'!$B$5:$B$3576,$B43))/SUM($I43:$N43)),\"-\")","v":"-"},{"$f":"IFERROR(((SUMIFS('Lista pracowników'!$A$5:$A$3576,'Lista pracowników'!$G$5:$G$3576,T$4,'Lista pracowników'!$B$5:$B$3576,$B43))/SUM($I43:$N43)),\"-\")","v":"-"},{"$f":"IFERROR(((SUMIFS('Lista pracowników'!$A$5:$A$3576,'Lista pracowników'!$G$5:$G$3576,U$4,'Lista pracowników'!$B$5:$B$3576,$B43))/SUM($I43:$N43)),\"-\")","v":"-"}]
[39,null,null,null,null,{"$f":"IF(E44>'Lista pracowników'!$M$4,\"-\",VLOOKUP($E44,'Siatka płac'!$B$6:$E$17,3,FALSE))","v":0},{"$f":"IF(E44>'Lista pracowników'!$M$4,\"-\",VLOOKUP($E44,'Siatka płac'!$B$6:$E$17,4,FALSE))","v":0},{"$f":"SUMIFS('Lista pracowników'!$A$5:$A$8386,'Lista pracowników'!$B$5:$B$8386,$B44)","v":0},{"$f":"SUMIFS('Lista pracowników'!$A$5:$A$3576,'Lista pracowników'!$G$5:$G$3576,I$4,'Lista pracowników'!$B$5:$B$3576,$B44)","v":0},{"$f":"SUMIFS('Lista pracowników'!$A$5:$A$3576,'Lista pracowników'!$G$5:$G$3576,J$4,'Lista pracowników'!$B$5:$B$3576,$B44)","v":0},{"$f":"SUMIFS('Lista pracowników'!$A$5:$A$3576,'Lista pracowników'!$G$5:$G$3576,K$4,'Lista pracowników'!$B$5:$B$3576,$B44)","v":0},{"$f":"SUMIFS('Lista pracowników'!$A$5:$A$3576,'Lista pracowników'!$G$5:$G$3576,L$4,'Lista pracowników'!$B$5:$B$3576,$B44)","v":0},{"$f":"SUMIFS('Lista pracowników'!$A$5:$A$3576,'Lista pracowników'!$G$5:$G$3576,M$4,'Lista pracowników'!$B$5:$B$3576,$B44)","v":0},{"$f":"SUMIFS('Lista pracowników'!$A$5:$A$3576,'Lista pracowników'!$G$5:$G$3576,N$4,'Lista pracowników'!$B$5:$B$3576,$B44)","v":0},null,{"$f":"IFERROR(((SUMIFS('Lista pracowników'!$A$5:$A$3576,'Lista pracowników'!$G$5:$G$3576,P$4,'Lista pracowników'!$B$5:$B$3576,$B44))/SUM($I44:$N44)),\"-\")","v":"-"},{"$f":"IFERROR(((SUMIFS('Lista pracowników'!$A$5:$A$3576,'Lista pracowników'!$G$5:$G$3576,Q$4,'Lista pracowników'!$B$5:$B$3576,$B44))/SUM($I44:$N44)),\"-\")","v":"-"},{"$f":"IFERROR(((SUMIFS('Lista pracowników'!$A$5:$A$3576,'Lista pracowników'!$G$5:$G$3576,R$4,'Lista pracowników'!$B$5:$B$3576,$B44))/(SUM($I44:$N44))),\"-\")","v":"-"},{"$f":"IFERROR(((SUMIFS('Lista pracowników'!$A$5:$A$3576,'Lista pracowników'!$G$5:$G$3576,S$4,'Lista pracowników'!$B$5:$B$3576,$B44))/SUM($I44:$N44)),\"-\")","v":"-"},{"$f":"IFERROR(((SUMIFS('Lista pracowników'!$A$5:$A$3576,'Lista pracowników'!$G$5:$G$3576,T$4,'Lista pracowników'!$B$5:$B$3576,$B44))/SUM($I44:$N44)),\"-\")","v":"-"},{"$f":"IFERROR(((SUMIFS('Lista pracowników'!$A$5:$A$3576,'Lista pracowników'!$G$5:$G$3576,U$4,'Lista pracowników'!$B$5:$B$3576,$B44))/SUM($I44:$N44)),\"-\")","v":"-"}]
[40,null,null,null,null,{"$f":"IF(E45>'Lista pracowników'!$M$4,\"-\",VLOOKUP($E45,'Siatka płac'!$B$6:$E$17,3,FALSE))","v":0},{"$f":"IF(E45>'Lista pracowników'!$M$4,\"-\",VLOOKUP($E45,'Siatka płac'!$B$6:$E$17,4,FALSE))","v":0},{"$f":"SUMIFS('Lista pracowników'!$A$5:$A$8386,'Lista pracowników'!$B$5:$B$8386,$B45)","v":0},{"$f":"SUMIFS('Lista pracowników'!$A$5:$A$3576,'Lista pracowników'!$G$5:$G$3576,I$4,'Lista pracowników'!$B$5:$B$3576,$B45)","v":0},{"$f":"SUMIFS('Lista pracowników'!$A$5:$A$3576,'Lista pracowników'!$G$5:$G$3576,J$4,'Lista pracowników'!$B$5:$B$3576,$B45)","v":0},{"$f":"SUMIFS('Lista pracowników'!$A$5:$A$3576,'Lista pracowników'!$G$5:$G$3576,K$4,'Lista pracowników'!$B$5:$B$3576,$B45)","v":0},{"$f":"SUMIFS('Lista pracowników'!$A$5:$A$3576,'Lista pracowników'!$G$5:$G$3576,L$4,'Lista pracowników'!$B$5:$B$3576,$B45)","v":0},{"$f":"SUMIFS('Lista pracowników'!$A$5:$A$3576,'Lista pracowników'!$G$5:$G$3576,M$4,'Lista pracowników'!$B$5:$B$3576,$B45)","v":0},{"$f":"SUMIFS('Lista pracowników'!$A$5:$A$3576,'Lista pracowników'!$G$5:$G$3576,N$4,'Lista pracowników'!$B$5:$B$3576,$B45)","v":0},null,{"$f":"IFERROR(((SUMIFS('Lista pracowników'!$A$5:$A$3576,'Lista pracowników'!$G$5:$G$3576,P$4,'Lista pracowników'!$B$5:$B$3576,$B45))/SUM($I45:$N45)),\"-\")","v":"-"},{"$f":"IFERROR(((SUMIFS('Lista pracowników'!$A$5:$A$3576,'Lista pracowników'!$G$5:$G$3576,Q$4,'Lista pracowników'!$B$5:$B$3576,$B45))/SUM($I45:$N45)),\"-\")","v":"-"},{"$f":"IFERROR(((SUMIFS('Lista pracowników'!$A$5:$A$3576,'Lista pracowników'!$G$5:$G$3576,R$4,'Lista pracowników'!$B$5:$B$3576,$B45))/(SUM($I45:$N45))),\"-\")","v":"-"},{"$f":"IFERROR(((SUMIFS('Lista pracowników'!$A$5:$A$3576,'Lista pracowników'!$G$5:$G$3576,S$4,'Lista pracowników'!$B$5:$B$3576,$B45))/SUM($I45:$N45)),\"-\")","v":"-"},{"$f":"IFERROR(((SUMIFS('Lista pracowników'!$A$5:$A$3576,'Lista pracowników'!$G$5:$G$3576,T$4,'Lista pracowników'!$B$5:$B$3576,$B45))/SUM($I45:$N45)),\"-\")","v":"-"},{"$f":"IFERROR(((SUMIFS('Lista pracowników'!$A$5:$A$3576,'Lista pracowników'!$G$5:$G$3576,U$4,'Lista pracowników'!$B$5:$B$3576,$B45))/SUM($I45:$N45)),\"-\")","v":"-"}]
[41,null,null,null,null,{"$f":"IF(E46>'Lista pracowników'!$M$4,\"-\",VLOOKUP($E46,'Siatka płac'!$B$6:$E$17,3,FALSE))","v":0},{"$f":"IF(E46>'Lista pracowników'!$M$4,\"-\",VLOOKUP($E46,'Siatka płac'!$B$6:$E$17,4,FALSE))","v":0},{"$f":"SUMIFS('Lista pracowników'!$A$5:$A$8386,'Lista pracowników'!$B$5:$B$8386,$B46)","v":0},{"$f":"SUMIFS('Lista pracowników'!$A$5:$A$3576,'Lista pracowników'!$G$5:$G$3576,I$4,'Lista pracowników'!$B$5:$B$3576,$B46)","v":0},{"$f":"SUMIFS('Lista pracowników'!$A$5:$A$3576,'Lista pracowników'!$G$5:$G$3576,J$4,'Lista pracowników'!$B$5:$B$3576,$B46)","v":0},{"$f":"SUMIFS('Lista pracowników'!$A$5:$A$3576,'Lista pracowników'!$G$5:$G$3576,K$4,'Lista pracowników'!$B$5:$B$3576,$B46)","v":0},{"$f":"SUMIFS('Lista pracowników'!$A$5:$A$3576,'Lista pracowników'!$G$5:$G$3576,L$4,'Lista pracowników'!$B$5:$B$3576,$B46)","v":0},{"$f":"SUMIFS('Lista pracowników'!$A$5:$A$3576,'Lista pracowników'!$G$5:$G$3576,M$4,'Lista pracowników'!$B$5:$B$3576,$B46)","v":0},{"$f":"SUMIFS('Lista pracowników'!$A$5:$A$3576,'Lista pracowników'!$G$5:$G$3576,N$4,'Lista pracowników'!$B$5:$B$3576,$B46)","v":0},null,{"$f":"IFERROR(((SUMIFS('Lista pracowników'!$A$5:$A$3576,'Lista pracowników'!$G$5:$G$3576,P$4,'Lista pracowników'!$B$5:$B$3576,$B46))/SUM($I46:$N46)),\"-\")","v":"-"},{"$f":"IFERROR(((SUMIFS('Lista pracowników'!$A$5:$A$3576,'Lista pracowników'!$G$5:$G$3576,Q$4,'Lista pracowników'!$B$5:$B$3576,$B46))/SUM($I46:$N46)),\"-\")","v":"-"},{"$f":"IFERROR(((SUMIFS('Lista pracowników'!$A$5:$A$3576,'Lista pracowników'!$G$5:$G$3576,R$4,'Lista pracowników'!$B$5:$B$3576,$B46))/(SUM($I46:$N46))),\"-\")","v":"-"},{"$f":"IFERROR(((SUMIFS('Lista pracowników'!$A$5:$A$3576,'Lista pracowników'!$G$5:$G$3576,S$4,'Lista pracowników'!$B$5:$B$3576,$B46))/SUM($I46:$N46)),\"-\")","v":"-"},{"$f":"IFERROR(((SUMIFS('Lista pracowników'!$A$5:$A$3576,'Lista pracowników'!$G$5:$G$3576,T$4,'Lista pracowników'!$B$5:$B$3576,$B46))/SUM($I46:$N46)),\"-\")","v":"-"},{"$f":"IFERROR(((SUMIFS('Lista pracowników'!$A$5:$A$3576,'Lista pracowników'!$G$5:$G$3576,U$4,'Lista pracowników'!$B$5:$B$3576,$B46))/SUM($I46:$N46)),\"-\")","v":"-"}]
[42,null,null,null,null,{"$f":"IF(E47>'Lista pracowników'!$M$4,\"-\",VLOOKUP($E47,'Siatka płac'!$B$6:$E$17,3,FALSE))","v":0},{"$f":"IF(E47>'Lista pracowników'!$M$4,\"-\",VLOOKUP($E47,'Siatka płac'!$B$6:$E$17,4,FALSE))","v":0},{"$f":"SUMIFS('Lista pracowników'!$A$5:$A$8386,'Lista pracowników'!$B$5:$B$8386,$B47)","v":0},{"$f":"SUMIFS('Lista pracowników'!$A$5:$A$3576,'Lista pracowników'!$G$5:$G$3576,I$4,'Lista pracowników'!$B$5:$B$3576,$B47)","v":0},{"$f":"SUMIFS('Lista pracowników'!$A$5:$A$3576,'Lista pracowników'!$G$5:$G$3576,J$4,'Lista pracowników'!$B$5:$B$3576,$B47)","v":0},{"$f":"SUMIFS('Lista pracowników'!$A$5:$A$3576,'Lista pracowników'!$G$5:$G$3576,K$4,'Lista pracowników'!$B$5:$B$3576,$B47)","v":0},{"$f":"SUMIFS('Lista pracowników'!$A$5:$A$3576,'Lista pracowników'!$G$5:$G$3576,L$4,'Lista pracowników'!$B$5:$B$3576,$B47)","v":0},{"$f":"SUMIFS('Lista pracowników'!$A$5:$A$3576,'Lista pracowników'!$G$5:$G$3576,M$4,'Lista pracowników'!$B$5:$B$3576,$B47)","v":0},{"$f":"SUMIFS('Lista pracowników'!$A$5:$A$3576,'Lista pracowników'!$G$5:$G$3576,N$4,'Lista pracowników'!$B$5:$B$3576,$B47)","v":0},null,{"$f":"IFERROR(((SUMIFS('Lista pracowników'!$A$5:$A$3576,'Lista pracowników'!$G$5:$G$3576,P$4,'Lista pracowników'!$B$5:$B$3576,$B47))/SUM($I47:$N47)),\"-\")","v":"-"},{"$f":"IFERROR(((SUMIFS('Lista pracowników'!$A$5:$A$3576,'Lista pracowników'!$G$5:$G$3576,Q$4,'Lista pracowników'!$B$5:$B$3576,$B47))/SUM($I47:$N47)),\"-\")","v":"-"},{"$f":"IFERROR(((SUMIFS('Lista pracowników'!$A$5:$A$3576,'Lista pracowników'!$G$5:$G$3576,R$4,'Lista pracowników'!$B$5:$B$3576,$B47))/(SUM($I47:$N47))),\"-\")","v":"-"},{"$f":"IFERROR(((SUMIFS('Lista pracowników'!$A$5:$A$3576,'Lista pracowników'!$G$5:$G$3576,S$4,'Lista pracowników'!$B$5:$B$3576,$B47))/SUM($I47:$N47)),\"-\")","v":"-"},{"$f":"IFERROR(((SUMIFS('Lista pracowników'!$A$5:$A$3576,'Lista pracowników'!$G$5:$G$3576,T$4,'Lista pracowników'!$B$5:$B$3576,$B47))/SUM($I47:$N47)),\"-\")","v":"-"},{"$f":"IFERROR(((SUMIFS('Lista pracowników'!$A$5:$A$3576,'Lista pracowników'!$G$5:$G$3576,U$4,'Lista pracowników'!$B$5:$B$3576,$B47))/SUM($I47:$N47)),\"-\")","v":"-"}]
[43,null,null,null,null,{"$f":"IF(E48>'Lista pracowników'!$M$4,\"-\",VLOOKUP($E48,'Siatka płac'!$B$6:$E$17,3,FALSE))","v":0},{"$f":"IF(E48>'Lista pracowników'!$M$4,\"-\",VLOOKUP($E48,'Siatka płac'!$B$6:$E$17,4,FALSE))","v":0},{"$f":"SUMIFS('Lista pracowników'!$A$5:$A$8386,'Lista pracowników'!$B$5:$B$8386,$B48)","v":0},{"$f":"SUMIFS('Lista pracowników'!$A$5:$A$3576,'Lista pracowników'!$G$5:$G$3576,I$4,'Lista pracowników'!$B$5:$B$3576,$B48)","v":0},{"$f":"SUMIFS('Lista pracowników'!$A$5:$A$3576,'Lista pracowników'!$G$5:$G$3576,J$4,'Lista pracowników'!$B$5:$B$3576,$B48)","v":0},{"$f":"SUMIFS('Lista pracowników'!$A$5:$A$3576,'Lista pracowników'!$G$5:$G$3576,K$4,'Lista pracowników'!$B$5:$B$3576,$B48)","v":0},{"$f":"SUMIFS('Lista pracowników'!$A$5:$A$3576,'Lista pracowników'!$G$5:$G$3576,L$4,'Lista pracowników'!$B$5:$B$3576,$B48)","v":0},{"$f":"SUMIFS('Lista pracowników'!$A$5:$A$3576,'Lista pracowników'!$G$5:$G$3576,M$4,'Lista pracowników'!$B$5:$B$3576,$B48)","v":0},{"$f":"SUMIFS('Lista pracowników'!$A$5:$A$3576,'Lista pracowników'!$G$5:$G$3576,N$4,'Lista pracowników'!$B$5:$B$3576,$B48)","v":0},null,{"$f":"IFERROR(((SUMIFS('Lista pracowników'!$A$5:$A$3576,'Lista pracowników'!$G$5:$G$3576,P$4,'Lista pracowników'!$B$5:$B$3576,$B48))/SUM($I48:$N48)),\"-\")","v":"-"},{"$f":"IFERROR(((SUMIFS('Lista pracowników'!$A$5:$A$3576,'Lista pracowników'!$G$5:$G$3576,Q$4,'Lista pracowników'!$B$5:$B$3576,$B48))/SUM($I48:$N48)),\"-\")","v":"-"},{"$f":"IFERROR(((SUMIFS('Lista pracowników'!$A$5:$A$3576,'Lista pracowników'!$G$5:$G$3576,R$4,'Lista pracowników'!$B$5:$B$3576,$B48))/(SUM($I48:$N48))),\"-\")","v":"-"},{"$f":"IFERROR(((SUMIFS('Lista pracowników'!$A$5:$A$3576,'Lista pracowników'!$G$5:$G$3576,S$4,'Lista pracowników'!$B$5:$B$3576,$B48))/SUM($I48:$N48)),\"-\")","v":"-"},{"$f":"IFERROR(((SUMIFS('Lista pracowników'!$A$5:$A$3576,'Lista pracowników'!$G$5:$G$3576,T$4,'Lista pracowników'!$B$5:$B$3576,$B48))/SUM($I48:$N48)),\"-\")","v":"-"},{"$f":"IFERROR(((SUMIFS('Lista pracowników'!$A$5:$A$3576,'Lista pracowników'!$G$5:$G$3576,U$4,'Lista pracowników'!$B$5:$B$3576,$B48))/SUM($I48:$N48)),\"-\")","v":"-"}]
[44,null,null,null,null,{"$f":"IF(E49>'Lista pracowników'!$M$4,\"-\",VLOOKUP($E49,'Siatka płac'!$B$6:$E$17,3,FALSE))","v":0},{"$f":"IF(E49>'Lista pracowników'!$M$4,\"-\",VLOOKUP($E49,'Siatka płac'!$B$6:$E$17,4,FALSE))","v":0},{"$f":"SUMIFS('Lista pracowników'!$A$5:$A$8386,'Lista pracowników'!$B$5:$B$8386,$B49)","v":0},{"$f":"SUMIFS('Lista pracowników'!$A$5:$A$3576,'Lista pracowników'!$G$5:$G$3576,I$4,'Lista pracowników'!$B$5:$B$3576,$B49)","v":0},{"$f":"SUMIFS('Lista pracowników'!$A$5:$A$3576,'Lista pracowników'!$G$5:$G$3576,J$4,'Lista pracowników'!$B$5:$B$3576,$B49)","v":0},{"$f":"SUMIFS('Lista pracowników'!$A$5:$A$3576,'Lista pracowników'!$G$5:$G$3576,K$4,'Lista pracowników'!$B$5:$B$3576,$B49)","v":0},{"$f":"SUMIFS('Lista pracowników'!$A$5:$A$3576,'Lista pracowników'!$G$5:$G$3576,L$4,'Lista pracowników'!$B$5:$B$3576,$B49)","v":0},{"$f":"SUMIFS('Lista pracowników'!$A$5:$A$3576,'Lista pracowników'!$G$5:$G$3576,M$4,'Lista pracowników'!$B$5:$B$3576,$B49)","v":0},{"$f":"SUMIFS('Lista pracowników'!$A$5:$A$3576,'Lista pracowników'!$G$5:$G$3576,N$4,'Lista pracowników'!$B$5:$B$3576,$B49)","v":0},null,{"$f":"IFERROR(((SUMIFS('Lista pracowników'!$A$5:$A$3576,'Lista pracowników'!$G$5:$G$3576,P$4,'Lista pracowników'!$B$5:$B$3576,$B49))/SUM($I49:$N49)),\"-\")","v":"-"},{"$f":"IFERROR(((SUMIFS('Lista pracowników'!$A$5:$A$3576,'Lista pracowników'!$G$5:$G$3576,Q$4,'Lista pracowników'!$B$5:$B$3576,$B49))/SUM($I49:$N49)),\"-\")","v":"-"},{"$f":"IFERROR(((SUMIFS('Lista pracowników'!$A$5:$A$3576,'Lista pracowników'!$G$5:$G$3576,R$4,'Lista pracowników'!$B$5:$B$3576,$B49))/(SUM($I49:$N49))),\"-\")","v":"-"},{"$f":"IFERROR(((SUMIFS('Lista pracowników'!$A$5:$A$3576,'Lista pracowników'!$G$5:$G$3576,S$4,'Lista pracowników'!$B$5:$B$3576,$B49))/SUM($I49:$N49)),\"-\")","v":"-"},{"$f":"IFERROR(((SUMIFS('Lista pracowników'!$A$5:$A$3576,'Lista pracowników'!$G$5:$G$3576,T$4,'Lista pracowników'!$B$5:$B$3576,$B49))/SUM($I49:$N49)),\"-\")","v":"-"},{"$f":"IFERROR(((SUMIFS('Lista pracowników'!$A$5:$A$3576,'Lista pracowników'!$G$5:$G$3576,U$4,'Lista pracowników'!$B$5:$B$3576,$B49))/SUM($I49:$N49)),\"-\")","v":"-"}]
[45,null,null,null,null,{"$f":"IF(E50>'Lista pracowników'!$M$4,\"-\",VLOOKUP($E50,'Siatka płac'!$B$6:$E$17,3,FALSE))","v":0},{"$f":"IF(E50>'Lista pracowników'!$M$4,\"-\",VLOOKUP($E50,'Siatka płac'!$B$6:$E$17,4,FALSE))","v":0},{"$f":"SUMIFS('Lista pracowników'!$A$5:$A$8386,'Lista pracowników'!$B$5:$B$8386,$B50)","v":0},{"$f":"SUMIFS('Lista pracowników'!$A$5:$A$3576,'Lista pracowników'!$G$5:$G$3576,I$4,'Lista pracowników'!$B$5:$B$3576,$B50)","v":0},{"$f":"SUMIFS('Lista pracowników'!$A$5:$A$3576,'Lista pracowników'!$G$5:$G$3576,J$4,'Lista pracowników'!$B$5:$B$3576,$B50)","v":0},{"$f":"SUMIFS('Lista pracowników'!$A$5:$A$3576,'Lista pracowników'!$G$5:$G$3576,K$4,'Lista pracowników'!$B$5:$B$3576,$B50)","v":0},{"$f":"SUMIFS('Lista pracowników'!$A$5:$A$3576,'Lista pracowników'!$G$5:$G$3576,L$4,'Lista pracowników'!$B$5:$B$3576,$B50)","v":0},{"$f":"SUMIFS('Lista pracowników'!$A$5:$A$3576,'Lista pracowników'!$G$5:$G$3576,M$4,'Lista pracowników'!$B$5:$B$3576,$B50)","v":0},{"$f":"SUMIFS('Lista pracowników'!$A$5:$A$3576,'Lista pracowników'!$G$5:$G$3576,N$4,'Lista pracowników'!$B$5:$B$3576,$B50)","v":0},null,{"$f":"IFERROR(((SUMIFS('Lista pracowników'!$A$5:$A$3576,'Lista pracowników'!$G$5:$G$3576,P$4,'Lista pracowników'!$B$5:$B$3576,$B50))/SUM($I50:$N50)),\"-\")","v":"-"},{"$f":"IFERROR(((SUMIFS('Lista pracowników'!$A$5:$A$3576,'Lista pracowników'!$G$5:$G$3576,Q$4,'Lista pracowników'!$B$5:$B$3576,$B50))/SUM($I50:$N50)),\"-\")","v":"-"},{"$f":"IFERROR(((SUMIFS('Lista pracowników'!$A$5:$A$3576,'Lista pracowników'!$G$5:$G$3576,R$4,'Lista pracowników'!$B$5:$B$3576,$B50))/(SUM($I50:$N50))),\"-\")","v":"-"},{"$f":"IFERROR(((SUMIFS('Lista pracowników'!$A$5:$A$3576,'Lista pracowników'!$G$5:$G$3576,S$4,'Lista pracowników'!$B$5:$B$3576,$B50))/SUM($I50:$N50)),\"-\")","v":"-"},{"$f":"IFERROR(((SUMIFS('Lista pracowników'!$A$5:$A$3576,'Lista pracowników'!$G$5:$G$3576,T$4,'Lista pracowników'!$B$5:$B$3576,$B50))/SUM($I50:$N50)),\"-\")","v":"-"},{"$f":"IFERROR(((SUMIFS('Lista pracowników'!$A$5:$A$3576,'Lista pracowników'!$G$5:$G$3576,U$4,'Lista pracowników'!$B$5:$B$3576,$B50))/SUM($I50:$N50)),\"-\")","v":"-"}]
[46,null,null,null,null,{"$f":"IF(E51>'Lista pracowników'!$M$4,\"-\",VLOOKUP($E51,'Siatka płac'!$B$6:$E$17,3,FALSE))","v":0},{"$f":"IF(E51>'Lista pracowników'!$M$4,\"-\",VLOOKUP($E51,'Siatka płac'!$B$6:$E$17,4,FALSE))","v":0},{"$f":"SUMIFS('Lista pracowników'!$A$5:$A$8386,'Lista pracowników'!$B$5:$B$8386,$B51)","v":0},{"$f":"SUMIFS('Lista pracowników'!$A$5:$A$3576,'Lista pracowników'!$G$5:$G$3576,I$4,'Lista pracowników'!$B$5:$B$3576,$B51)","v":0},{"$f":"SUMIFS('Lista pracowników'!$A$5:$A$3576,'Lista pracowników'!$G$5:$G$3576,J$4,'Lista pracowników'!$B$5:$B$3576,$B51)","v":0},{"$f":"SUMIFS('Lista pracowników'!$A$5:$A$3576,'Lista pracowników'!$G$5:$G$3576,K$4,'Lista pracowników'!$B$5:$B$3576,$B51)","v":0},{"$f":"SUMIFS('Lista pracowników'!$A$5:$A$3576,'Lista pracowników'!$G$5:$G$3576,L$4,'Lista pracowników'!$B$5:$B$3576,$B51)","v":0},{"$f":"SUMIFS('Lista pracowników'!$A$5:$A$3576,'Lista pracowników'!$G$5:$G$3576,M$4,'Lista pracowników'!$B$5:$B$3576,$B51)","v":0},{"$f":"SUMIFS('Lista pracowników'!$A$5:$A$3576,'Lista pracowników'!$G$5:$G$3576,N$4,'Lista pracowników'!$B$5:$B$3576,$B51)","v":0},null,{"$f":"IFERROR(((SUMIFS('Lista pracowników'!$A$5:$A$3576,'Lista pracowników'!$G$5:$G$3576,P$4,'Lista pracowników'!$B$5:$B$3576,$B51))/SUM($I51:$N51)),\"-\")","v":"-"},{"$f":"IFERROR(((SUMIFS('Lista pracowników'!$A$5:$A$3576,'Lista pracowników'!$G$5:$G$3576,Q$4,'Lista pracowników'!$B$5:$B$3576,$B51))/SUM($I51:$N51)),\"-\")","v":"-"},{"$f":"IFERROR(((SUMIFS('Lista pracowników'!$A$5:$A$3576,'Lista pracowników'!$G$5:$G$3576,R$4,'Lista pracowników'!$B$5:$B$3576,$B51))/(SUM($I51:$N51))),\"-\")","v":"-"},{"$f":"IFERROR(((SUMIFS('Lista pracowników'!$A$5:$A$3576,'Lista pracowników'!$G$5:$G$3576,S$4,'Lista pracowników'!$B$5:$B$3576,$B51))/SUM($I51:$N51)),\"-\")","v":"-"},{"$f":"IFERROR(((SUMIFS('Lista pracowników'!$A$5:$A$3576,'Lista pracowników'!$G$5:$G$3576,T$4,'Lista pracowników'!$B$5:$B$3576,$B51))/SUM($I51:$N51)),\"-\")","v":"-"},{"$f":"IFERROR(((SUMIFS('Lista pracowników'!$A$5:$A$3576,'Lista pracowników'!$G$5:$G$3576,U$4,'Lista pracowników'!$B$5:$B$3576,$B51))/SUM($I51:$N51)),\"-\")","v":"-"}]
[47,null,null,null,null,{"$f":"IF(E52>'Lista pracowników'!$M$4,\"-\",VLOOKUP($E52,'Siatka płac'!$B$6:$E$17,3,FALSE))","v":0},{"$f":"IF(E52>'Lista pracowników'!$M$4,\"-\",VLOOKUP($E52,'Siatka płac'!$B$6:$E$17,4,FALSE))","v":0},{"$f":"SUMIFS('Lista pracowników'!$A$5:$A$8386,'Lista pracowników'!$B$5:$B$8386,$B52)","v":0},{"$f":"SUMIFS('Lista pracowników'!$A$5:$A$3576,'Lista pracowników'!$G$5:$G$3576,I$4,'Lista pracowników'!$B$5:$B$3576,$B52)","v":0},{"$f":"SUMIFS('Lista pracowników'!$A$5:$A$3576,'Lista pracowników'!$G$5:$G$3576,J$4,'Lista pracowników'!$B$5:$B$3576,$B52)","v":0},{"$f":"SUMIFS('Lista pracowników'!$A$5:$A$3576,'Lista pracowników'!$G$5:$G$3576,K$4,'Lista pracowników'!$B$5:$B$3576,$B52)","v":0},{"$f":"SUMIFS('Lista pracowników'!$A$5:$A$3576,'Lista pracowników'!$G$5:$G$3576,L$4,'Lista pracowników'!$B$5:$B$3576,$B52)","v":0},{"$f":"SUMIFS('Lista pracowników'!$A$5:$A$3576,'Lista pracowników'!$G$5:$G$3576,M$4,'Lista pracowników'!$B$5:$B$3576,$B52)","v":0},{"$f":"SUMIFS('Lista pracowników'!$A$5:$A$3576,'Lista pracowników'!$G$5:$G$3576,N$4,'Lista pracowników'!$B$5:$B$3576,$B52)","v":0},null,{"$f":"IFERROR(((SUMIFS('Lista pracowników'!$A$5:$A$3576,'Lista pracowników'!$G$5:$G$3576,P$4,'Lista pracowników'!$B$5:$B$3576,$B52))/SUM($I52:$N52)),\"-\")","v":"-"},{"$f":"IFERROR(((SUMIFS('Lista pracowników'!$A$5:$A$3576,'Lista pracowników'!$G$5:$G$3576,Q$4,'Lista pracowników'!$B$5:$B$3576,$B52))/SUM($I52:$N52)),\"-\")","v":"-"},{"$f":"IFERROR(((SUMIFS('Lista pracowników'!$A$5:$A$3576,'Lista pracowników'!$G$5:$G$3576,R$4,'Lista pracowników'!$B$5:$B$3576,$B52))/(SUM($I52:$N52))),\"-\")","v":"-"},{"$f":"IFERROR(((SUMIFS('Lista pracowników'!$A$5:$A$3576,'Lista pracowników'!$G$5:$G$3576,S$4,'Lista pracowników'!$B$5:$B$3576,$B52))/SUM($I52:$N52)),\"-\")","v":"-"},{"$f":"IFERROR(((SUMIFS('Lista pracowników'!$A$5:$A$3576,'Lista pracowników'!$G$5:$G$3576,T$4,'Lista pracowników'!$B$5:$B$3576,$B52))/SUM($I52:$N52)),\"-\")","v":"-"},{"$f":"IFERROR(((SUMIFS('Lista pracowników'!$A$5:$A$3576,'Lista pracowników'!$G$5:$G$3576,U$4,'Lista pracowników'!$B$5:$B$3576,$B52))/SUM($I52:$N52)),\"-\")","v":"-"}]
[48,null,null,null,null,{"$f":"IF(E53>'Lista pracowników'!$M$4,\"-\",VLOOKUP($E53,'Siatka płac'!$B$6:$E$17,3,FALSE))","v":0},{"$f":"IF(E53>'Lista pracowników'!$M$4,\"-\",VLOOKUP($E53,'Siatka płac'!$B$6:$E$17,4,FALSE))","v":0},{"$f":"SUMIFS('Lista pracowników'!$A$5:$A$8386,'Lista pracowników'!$B$5:$B$8386,$B53)","v":0},{"$f":"SUMIFS('Lista pracowników'!$A$5:$A$3576,'Lista pracowników'!$G$5:$G$3576,I$4,'Lista pracowników'!$B$5:$B$3576,$B53)","v":0},{"$f":"SUMIFS('Lista pracowników'!$A$5:$A$3576,'Lista pracowników'!$G$5:$G$3576,J$4,'Lista pracowników'!$B$5:$B$3576,$B53)","v":0},{"$f":"SUMIFS('Lista pracowników'!$A$5:$A$3576,'Lista pracowników'!$G$5:$G$3576,K$4,'Lista pracowników'!$B$5:$B$3576,$B53)","v":0},{"$f":"SUMIFS('Lista pracowników'!$A$5:$A$3576,'Lista pracowników'!$G$5:$G$3576,L$4,'Lista pracowników'!$B$5:$B$3576,$B53)","v":0},{"$f":"SUMIFS('Lista pracowników'!$A$5:$A$3576,'Lista pracowników'!$G$5:$G$3576,M$4,'Lista pracowników'!$B$5:$B$3576,$B53)","v":0},{"$f":"SUMIFS('Lista pracowników'!$A$5:$A$3576,'Lista pracowników'!$G$5:$G$3576,N$4,'Lista pracowników'!$B$5:$B$3576,$B53)","v":0},null,{"$f":"IFERROR(((SUMIFS('Lista pracowników'!$A$5:$A$3576,'Lista pracowników'!$G$5:$G$3576,P$4,'Lista pracowników'!$B$5:$B$3576,$B53))/SUM($I53:$N53)),\"-\")","v":"-"},{"$f":"IFERROR(((SUMIFS('Lista pracowników'!$A$5:$A$3576,'Lista pracowników'!$G$5:$G$3576,Q$4,'Lista pracowników'!$B$5:$B$3576,$B53))/SUM($I53:$N53)),\"-\")","v":"-"},{"$f":"IFERROR(((SUMIFS('Lista pracowników'!$A$5:$A$3576,'Lista pracowników'!$G$5:$G$3576,R$4,'Lista pracowników'!$B$5:$B$3576,$B53))/(SUM($I53:$N53))),\"-\")","v":"-"},{"$f":"IFERROR(((SUMIFS('Lista pracowników'!$A$5:$A$3576,'Lista pracowników'!$G$5:$G$3576,S$4,'Lista pracowników'!$B$5:$B$3576,$B53))/SUM($I53:$N53)),\"-\")","v":"-"},{"$f":"IFERROR(((SUMIFS('Lista pracowników'!$A$5:$A$3576,'Lista pracowników'!$G$5:$G$3576,T$4,'Lista pracowników'!$B$5:$B$3576,$B53))/SUM($I53:$N53)),\"-\")","v":"-"},{"$f":"IFERROR(((SUMIFS('Lista pracowników'!$A$5:$A$3576,'Lista pracowników'!$G$5:$G$3576,U$4,'Lista pracowników'!$B$5:$B$3576,$B53))/SUM($I53:$N53)),\"-\")","v":"-"}]
[49,null,null,null,null,{"$f":"IF(E54>'Lista pracowników'!$M$4,\"-\",VLOOKUP($E54,'Siatka płac'!$B$6:$E$17,3,FALSE))","v":0},{"$f":"IF(E54>'Lista pracowników'!$M$4,\"-\",VLOOKUP($E54,'Siatka płac'!$B$6:$E$17,4,FALSE))","v":0},{"$f":"SUMIFS('Lista pracowników'!$A$5:$A$8386,'Lista pracowników'!$B$5:$B$8386,$B54)","v":0},{"$f":"SUMIFS('Lista pracowników'!$A$5:$A$3576,'Lista pracowników'!$G$5:$G$3576,I$4,'Lista pracowników'!$B$5:$B$3576,$B54)","v":0},{"$f":"SUMIFS('Lista pracowników'!$A$5:$A$3576,'Lista pracowników'!$G$5:$G$3576,J$4,'Lista pracowników'!$B$5:$B$3576,$B54)","v":0},{"$f":"SUMIFS('Lista pracowników'!$A$5:$A$3576,'Lista pracowników'!$G$5:$G$3576,K$4,'Lista pracowników'!$B$5:$B$3576,$B54)","v":0},{"$f":"SUMIFS('Lista pracowników'!$A$5:$A$3576,'Lista pracowników'!$G$5:$G$3576,L$4,'Lista pracowników'!$B$5:$B$3576,$B54)","v":0},{"$f":"SUMIFS('Lista pracowników'!$A$5:$A$3576,'Lista pracowników'!$G$5:$G$3576,M$4,'Lista pracowników'!$B$5:$B$3576,$B54)","v":0},{"$f":"SUMIFS('Lista pracowników'!$A$5:$A$3576,'Lista pracowników'!$G$5:$G$3576,N$4,'Lista pracowników'!$B$5:$B$3576,$B54)","v":0},null,{"$f":"IFERROR(((SUMIFS('Lista pracowników'!$A$5:$A$3576,'Lista pracowników'!$G$5:$G$3576,P$4,'Lista pracowników'!$B$5:$B$3576,$B54))/SUM($I54:$N54)),\"-\")","v":"-"},{"$f":"IFERROR(((SUMIFS('Lista pracowników'!$A$5:$A$3576,'Lista pracowników'!$G$5:$G$3576,Q$4,'Lista pracowników'!$B$5:$B$3576,$B54))/SUM($I54:$N54)),\"-\")","v":"-"},{"$f":"IFERROR(((SUMIFS('Lista pracowników'!$A$5:$A$3576,'Lista pracowników'!$G$5:$G$3576,R$4,'Lista pracowników'!$B$5:$B$3576,$B54))/(SUM($I54:$N54))),\"-\")","v":"-"},{"$f":"IFERROR(((SUMIFS('Lista pracowników'!$A$5:$A$3576,'Lista pracowników'!$G$5:$G$3576,S$4,'Lista pracowników'!$B$5:$B$3576,$B54))/SUM($I54:$N54)),\"-\")","v":"-"},{"$f":"IFERROR(((SUMIFS('Lista pracowników'!$A$5:$A$3576,'Lista pracowników'!$G$5:$G$3576,T$4,'Lista pracowników'!$B$5:$B$3576,$B54))/SUM($I54:$N54)),\"-\")","v":"-"},{"$f":"IFERROR(((SUMIFS('Lista pracowników'!$A$5:$A$3576,'Lista pracowników'!$G$5:$G$3576,U$4,'Lista pracowników'!$B$5:$B$3576,$B54))/SUM($I54:$N54)),\"-\")","v":"-"}]
[50,null,null,null,null,{"$f":"IF(E55>'Lista pracowników'!$M$4,\"-\",VLOOKUP($E55,'Siatka płac'!$B$6:$E$17,3,FALSE))","v":0},{"$f":"IF(E55>'Lista pracowników'!$M$4,\"-\",VLOOKUP($E55,'Siatka płac'!$B$6:$E$17,4,FALSE))","v":0},{"$f":"SUMIFS('Lista pracowników'!$A$5:$A$8386,'Lista pracowników'!$B$5:$B$8386,$B55)","v":0},{"$f":"SUMIFS('Lista pracowników'!$A$5:$A$3576,'Lista pracowników'!$G$5:$G$3576,I$4,'Lista pracowników'!$B$5:$B$3576,$B55)","v":0},{"$f":"SUMIFS('Lista pracowników'!$A$5:$A$3576,'Lista pracowników'!$G$5:$G$3576,J$4,'Lista pracowników'!$B$5:$B$3576,$B55)","v":0},{"$f":"SUMIFS('Lista pracowników'!$A$5:$A$3576,'Lista pracowników'!$G$5:$G$3576,K$4,'Lista pracowników'!$B$5:$B$3576,$B55)","v":0},{"$f":"SUMIFS('Lista pracowników'!$A$5:$A$3576,'Lista pracowników'!$G$5:$G$3576,L$4,'Lista pracowników'!$B$5:$B$3576,$B55)","v":0},{"$f":"SUMIFS('Lista pracowników'!$A$5:$A$3576,'Lista pracowników'!$G$5:$G$3576,M$4,'Lista pracowników'!$B$5:$B$3576,$B55)","v":0},{"$f":"SUMIFS('Lista pracowników'!$A$5:$A$3576,'Lista pracowników'!$G$5:$G$3576,N$4,'Lista pracowników'!$B$5:$B$3576,$B55)","v":0},null,{"$f":"IFERROR(((SUMIFS('Lista pracowników'!$A$5:$A$3576,'Lista pracowników'!$G$5:$G$3576,P$4,'Lista pracowników'!$B$5:$B$3576,$B55))/SUM($I55:$N55)),\"-\")","v":"-"},{"$f":"IFERROR(((SUMIFS('Lista pracowników'!$A$5:$A$3576,'Lista pracowników'!$G$5:$G$3576,Q$4,'Lista pracowników'!$B$5:$B$3576,$B55))/SUM($I55:$N55)),\"-\")","v":"-"},{"$f":"IFERROR(((SUMIFS('Lista pracowników'!$A$5:$A$3576,'Lista pracowników'!$G$5:$G$3576,R$4,'Lista pracowników'!$B$5:$B$3576,$B55))/(SUM($I55:$N55))),\"-\")","v":"-"},{"$f":"IFERROR(((SUMIFS('Lista pracowników'!$A$5:$A$3576,'Lista pracowników'!$G$5:$G$3576,S$4,'Lista pracowników'!$B$5:$B$3576,$B55))/SUM($I55:$N55)),\"-\")","v":"-"},{"$f":"IFERROR(((SUMIFS('Lista pracowników'!$A$5:$A$3576,'Lista pracowników'!$G$5:$G$3576,T$4,'Lista pracowników'!$B$5:$B$3576,$B55))/SUM($I55:$N55)),\"-\")","v":"-"},{"$f":"IFERROR(((SUMIFS('Lista pracowników'!$A$5:$A$3576,'Lista pracowników'!$G$5:$G$3576,U$4,'Lista pracowników'!$B$5:$B$3576,$B55))/SUM($I55:$N55)),\"-\")","v":"-"}]
[51,null,null,null,null,{"$f":"IF(E56>'Lista pracowników'!$M$4,\"-\",VLOOKUP($E56,'Siatka płac'!$B$6:$E$17,3,FALSE))","v":0},{"$f":"IF(E56>'Lista pracowników'!$M$4,\"-\",VLOOKUP($E56,'Siatka płac'!$B$6:$E$17,4,FALSE))","v":0},{"$f":"SUMIFS('Lista pracowników'!$A$5:$A$8386,'Lista pracowników'!$B$5:$B$8386,$B56)","v":0},{"$f":"SUMIFS('Lista pracowników'!$A$5:$A$3576,'Lista pracowników'!$G$5:$G$3576,I$4,'Lista pracowników'!$B$5:$B$3576,$B56)","v":0},{"$f":"SUMIFS('Lista pracowników'!$A$5:$A$3576,'Lista pracowników'!$G$5:$G$3576,J$4,'Lista pracowników'!$B$5:$B$3576,$B56)","v":0},{"$f":"SUMIFS('Lista pracowników'!$A$5:$A$3576,'Lista pracowników'!$G$5:$G$3576,K$4,'Lista pracowników'!$B$5:$B$3576,$B56)","v":0},{"$f":"SUMIFS('Lista pracowników'!$A$5:$A$3576,'Lista pracowników'!$G$5:$G$3576,L$4,'Lista pracowników'!$B$5:$B$3576,$B56)","v":0},{"$f":"SUMIFS('Lista pracowników'!$A$5:$A$3576,'Lista pracowników'!$G$5:$G$3576,M$4,'Lista pracowników'!$B$5:$B$3576,$B56)","v":0},{"$f":"SUMIFS('Lista pracowników'!$A$5:$A$3576,'Lista pracowników'!$G$5:$G$3576,N$4,'Lista pracowników'!$B$5:$B$3576,$B56)","v":0},null,{"$f":"IFERROR(((SUMIFS('Lista pracowników'!$A$5:$A$3576,'Lista pracowników'!$G$5:$G$3576,P$4,'Lista pracowników'!$B$5:$B$3576,$B56))/SUM($I56:$N56)),\"-\")","v":"-"},{"$f":"IFERROR(((SUMIFS('Lista pracowników'!$A$5:$A$3576,'Lista pracowników'!$G$5:$G$3576,Q$4,'Lista pracowników'!$B$5:$B$3576,$B56))/SUM($I56:$N56)),\"-\")","v":"-"},{"$f":"IFERROR(((SUMIFS('Lista pracowników'!$A$5:$A$3576,'Lista pracowników'!$G$5:$G$3576,R$4,'Lista pracowników'!$B$5:$B$3576,$B56))/(SUM($I56:$N56))),\"-\")","v":"-"},{"$f":"IFERROR(((SUMIFS('Lista pracowników'!$A$5:$A$3576,'Lista pracowników'!$G$5:$G$3576,S$4,'Lista pracowników'!$B$5:$B$3576,$B56))/SUM($I56:$N56)),\"-\")","v":"-"},{"$f":"IFERROR(((SUMIFS('Lista pracowników'!$A$5:$A$3576,'Lista pracowników'!$G$5:$G$3576,T$4,'Lista pracowników'!$B$5:$B$3576,$B56))/SUM($I56:$N56)),\"-\")","v":"-"},{"$f":"IFERROR(((SUMIFS('Lista pracowników'!$A$5:$A$3576,'Lista pracowników'!$G$5:$G$3576,U$4,'Lista pracowników'!$B$5:$B$3576,$B56))/SUM($I56:$N56)),\"-\")","v":"-"}]
[52,null,null,null,null,{"$f":"IF(E57>'Lista pracowników'!$M$4,\"-\",VLOOKUP($E57,'Siatka płac'!$B$6:$E$17,3,FALSE))","v":0},{"$f":"IF(E57>'Lista pracowników'!$M$4,\"-\",VLOOKUP($E57,'Siatka płac'!$B$6:$E$17,4,FALSE))","v":0},{"$f":"SUMIFS('Lista pracowników'!$A$5:$A$8386,'Lista pracowników'!$B$5:$B$8386,$B57)","v":0},{"$f":"SUMIFS('Lista pracowników'!$A$5:$A$3576,'Lista pracowników'!$G$5:$G$3576,I$4,'Lista pracowników'!$B$5:$B$3576,$B57)","v":0},{"$f":"SUMIFS('Lista pracowników'!$A$5:$A$3576,'Lista pracowników'!$G$5:$G$3576,J$4,'Lista pracowników'!$B$5:$B$3576,$B57)","v":0},{"$f":"SUMIFS('Lista pracowników'!$A$5:$A$3576,'Lista pracowników'!$G$5:$G$3576,K$4,'Lista pracowników'!$B$5:$B$3576,$B57)","v":0},{"$f":"SUMIFS('Lista pracowników'!$A$5:$A$3576,'Lista pracowników'!$G$5:$G$3576,L$4,'Lista pracowników'!$B$5:$B$3576,$B57)","v":0},{"$f":"SUMIFS('Lista pracowników'!$A$5:$A$3576,'Lista pracowników'!$G$5:$G$3576,M$4,'Lista pracowników'!$B$5:$B$3576,$B57)","v":0},{"$f":"SUMIFS('Lista pracowników'!$A$5:$A$3576,'Lista pracowników'!$G$5:$G$3576,N$4,'Lista pracowników'!$B$5:$B$3576,$B57)","v":0},null,{"$f":"IFERROR(((SUMIFS('Lista pracowników'!$A$5:$A$3576,'Lista pracowników'!$G$5:$G$3576,P$4,'Lista pracowników'!$B$5:$B$3576,$B57))/SUM($I57:$N57)),\"-\")","v":"-"},{"$f":"IFERROR(((SUMIFS('Lista pracowników'!$A$5:$A$3576,'Lista pracowników'!$G$5:$G$3576,Q$4,'Lista pracowników'!$B$5:$B$3576,$B57))/SUM($I57:$N57)),\"-\")","v":"-"},{"$f":"IFERROR(((SUMIFS('Lista pracowników'!$A$5:$A$3576,'Lista pracowników'!$G$5:$G$3576,R$4,'Lista pracowników'!$B$5:$B$3576,$B57))/(SUM($I57:$N57))),\"-\")","v":"-"},{"$f":"IFERROR(((SUMIFS('Lista pracowników'!$A$5:$A$3576,'Lista pracowników'!$G$5:$G$3576,S$4,'Lista pracowników'!$B$5:$B$3576,$B57))/SUM($I57:$N57)),\"-\")","v":"-"},{"$f":"IFERROR(((SUMIFS('Lista pracowników'!$A$5:$A$3576,'Lista pracowników'!$G$5:$G$3576,T$4,'Lista pracowników'!$B$5:$B$3576,$B57))/SUM($I57:$N57)),\"-\")","v":"-"},{"$f":"IFERROR(((SUMIFS('Lista pracowników'!$A$5:$A$3576,'Lista pracowników'!$G$5:$G$3576,U$4,'Lista pracowników'!$B$5:$B$3576,$B57))/SUM($I57:$N57)),\"-\")","v":"-"}]
[53,null,null,null,null,{"$f":"IF(E58>'Lista pracowników'!$M$4,\"-\",VLOOKUP($E58,'Siatka płac'!$B$6:$E$17,3,FALSE))","v":0},{"$f":"IF(E58>'Lista pracowników'!$M$4,\"-\",VLOOKUP($E58,'Siatka płac'!$B$6:$E$17,4,FALSE))","v":0},{"$f":"SUMIFS('Lista pracowników'!$A$5:$A$8386,'Lista pracowników'!$B$5:$B$8386,$B58)","v":0},{"$f":"SUMIFS('Lista pracowników'!$A$5:$A$3576,'Lista pracowników'!$G$5:$G$3576,I$4,'Lista pracowników'!$B$5:$B$3576,$B58)","v":0},{"$f":"SUMIFS('Lista pracowników'!$A$5:$A$3576,'Lista pracowników'!$G$5:$G$3576,J$4,'Lista pracowników'!$B$5:$B$3576,$B58)","v":0},{"$f":"SUMIFS('Lista pracowników'!$A$5:$A$3576,'Lista pracowników'!$G$5:$G$3576,K$4,'Lista pracowników'!$B$5:$B$3576,$B58)","v":0},{"$f":"SUMIFS('Lista pracowników'!$A$5:$A$3576,'Lista pracowników'!$G$5:$G$3576,L$4,'Lista pracowników'!$B$5:$B$3576,$B58)","v":0},{"$f":"SUMIFS('Lista pracowników'!$A$5:$A$3576,'Lista pracowników'!$G$5:$G$3576,M$4,'Lista pracowników'!$B$5:$B$3576,$B58)","v":0},{"$f":"SUMIFS('Lista pracowników'!$A$5:$A$3576,'Lista pracowników'!$G$5:$G$3576,N$4,'Lista pracowników'!$B$5:$B$3576,$B58)","v":0},null,{"$f":"IFERROR(((SUMIFS('Lista pracowników'!$A$5:$A$3576,'Lista pracowników'!$G$5:$G$3576,P$4,'Lista pracowników'!$B$5:$B$3576,$B58))/SUM($I58:$N58)),\"-\")","v":"-"},{"$f":"IFERROR(((SUMIFS('Lista pracowników'!$A$5:$A$3576,'Lista pracowników'!$G$5:$G$3576,Q$4,'Lista pracowników'!$B$5:$B$3576,$B58))/SUM($I58:$N58)),\"-\")","v":"-"},{"$f":"IFERROR(((SUMIFS('Lista pracowników'!$A$5:$A$3576,'Lista pracowników'!$G$5:$G$3576,R$4,'Lista pracowników'!$B$5:$B$3576,$B58))/(SUM($I58:$N58))),\"-\")","v":"-"},{"$f":"IFERROR(((SUMIFS('Lista pracowników'!$A$5:$A$3576,'Lista pracowników'!$G$5:$G$3576,S$4,'Lista pracowników'!$B$5:$B$3576,$B58))/SUM($I58:$N58)),\"-\")","v":"-"},{"$f":"IFERROR(((SUMIFS('Lista pracowników'!$A$5:$A$3576,'Lista pracowników'!$G$5:$G$3576,T$4,'Lista pracowników'!$B$5:$B$3576,$B58))/SUM($I58:$N58)),\"-\")","v":"-"},{"$f":"IFERROR(((SUMIFS('Lista pracowników'!$A$5:$A$3576,'Lista pracowników'!$G$5:$G$3576,U$4,'Lista pracowników'!$B$5:$B$3576,$B58))/SUM($I58:$N58)),\"-\")","v":"-"}]
[54,null,null,null,null,{"$f":"IF(E59>'Lista pracowników'!$M$4,\"-\",VLOOKUP($E59,'Siatka płac'!$B$6:$E$17,3,FALSE))","v":0},{"$f":"IF(E59>'Lista pracowników'!$M$4,\"-\",VLOOKUP($E59,'Siatka płac'!$B$6:$E$17,4,FALSE))","v":0},{"$f":"SUMIFS('Lista pracowników'!$A$5:$A$8386,'Lista pracowników'!$B$5:$B$8386,$B59)","v":0},{"$f":"SUMIFS('Lista pracowników'!$A$5:$A$3576,'Lista pracowników'!$G$5:$G$3576,I$4,'Lista pracowników'!$B$5:$B$3576,$B59)","v":0},{"$f":"SUMIFS('Lista pracowników'!$A$5:$A$3576,'Lista pracowników'!$G$5:$G$3576,J$4,'Lista pracowników'!$B$5:$B$3576,$B59)","v":0},{"$f":"SUMIFS('Lista pracowników'!$A$5:$A$3576,'Lista pracowników'!$G$5:$G$3576,K$4,'Lista pracowników'!$B$5:$B$3576,$B59)","v":0},{"$f":"SUMIFS('Lista pracowników'!$A$5:$A$3576,'Lista pracowników'!$G$5:$G$3576,L$4,'Lista pracowników'!$B$5:$B$3576,$B59)","v":0},{"$f":"SUMIFS('Lista pracowników'!$A$5:$A$3576,'Lista pracowników'!$G$5:$G$3576,M$4,'Lista pracowników'!$B$5:$B$3576,$B59)","v":0},{"$f":"SUMIFS('Lista pracowników'!$A$5:$A$3576,'Lista pracowników'!$G$5:$G$3576,N$4,'Lista pracowników'!$B$5:$B$3576,$B59)","v":0},null,{"$f":"IFERROR(((SUMIFS('Lista pracowników'!$A$5:$A$3576,'Lista pracowników'!$G$5:$G$3576,P$4,'Lista pracowników'!$B$5:$B$3576,$B59))/SUM($I59:$N59)),\"-\")","v":"-"},{"$f":"IFERROR(((SUMIFS('Lista pracowników'!$A$5:$A$3576,'Lista pracowników'!$G$5:$G$3576,Q$4,'Lista pracowników'!$B$5:$B$3576,$B59))/SUM($I59:$N59)),\"-\")","v":"-"},{"$f":"IFERROR(((SUMIFS('Lista pracowników'!$A$5:$A$3576,'Lista pracowników'!$G$5:$G$3576,R$4,'Lista pracowników'!$B$5:$B$3576,$B59))/(SUM($I59:$N59))),\"-\")","v":"-"},{"$f":"IFERROR(((SUMIFS('Lista pracowników'!$A$5:$A$3576,'Lista pracowników'!$G$5:$G$3576,S$4,'Lista pracowników'!$B$5:$B$3576,$B59))/SUM($I59:$N59)),\"-\")","v":"-"},{"$f":"IFERROR(((SUMIFS('Lista pracowników'!$A$5:$A$3576,'Lista pracowników'!$G$5:$G$3576,T$4,'Lista pracowników'!$B$5:$B$3576,$B59))/SUM($I59:$N59)),\"-\")","v":"-"},{"$f":"IFERROR(((SUMIFS('Lista pracowników'!$A$5:$A$3576,'Lista pracowników'!$G$5:$G$3576,U$4,'Lista pracowników'!$B$5:$B$3576,$B59))/SUM($I59:$N59)),\"-\")","v":"-"}]
[55,null,null,null,null,{"$f":"IF(E60>'Lista pracowników'!$M$4,\"-\",VLOOKUP($E60,'Siatka płac'!$B$6:$E$17,3,FALSE))","v":0},{"$f":"IF(E60>'Lista pracowników'!$M$4,\"-\",VLOOKUP($E60,'Siatka płac'!$B$6:$E$17,4,FALSE))","v":0},{"$f":"SUMIFS('Lista pracowników'!$A$5:$A$8386,'Lista pracowników'!$B$5:$B$8386,$B60)","v":0},{"$f":"SUMIFS('Lista pracowników'!$A$5:$A$3576,'Lista pracowników'!$G$5:$G$3576,I$4,'Lista pracowników'!$B$5:$B$3576,$B60)","v":0},{"$f":"SUMIFS('Lista pracowników'!$A$5:$A$3576,'Lista pracowników'!$G$5:$G$3576,J$4,'Lista pracowników'!$B$5:$B$3576,$B60)","v":0},{"$f":"SUMIFS('Lista pracowników'!$A$5:$A$3576,'Lista pracowników'!$G$5:$G$3576,K$4,'Lista pracowników'!$B$5:$B$3576,$B60)","v":0},{"$f":"SUMIFS('Lista pracowników'!$A$5:$A$3576,'Lista pracowników'!$G$5:$G$3576,L$4,'Lista pracowników'!$B$5:$B$3576,$B60)","v":0},{"$f":"SUMIFS('Lista pracowników'!$A$5:$A$3576,'Lista pracowników'!$G$5:$G$3576,M$4,'Lista pracowników'!$B$5:$B$3576,$B60)","v":0},{"$f":"SUMIFS('Lista pracowników'!$A$5:$A$3576,'Lista pracowników'!$G$5:$G$3576,N$4,'Lista pracowników'!$B$5:$B$3576,$B60)","v":0},null,{"$f":"IFERROR(((SUMIFS('Lista pracowników'!$A$5:$A$3576,'Lista pracowników'!$G$5:$G$3576,P$4,'Lista pracowników'!$B$5:$B$3576,$B60))/SUM($I60:$N60)),\"-\")","v":"-"},{"$f":"IFERROR(((SUMIFS('Lista pracowników'!$A$5:$A$3576,'Lista pracowników'!$G$5:$G$3576,Q$4,'Lista pracowników'!$B$5:$B$3576,$B60))/SUM($I60:$N60)),\"-\")","v":"-"},{"$f":"IFERROR(((SUMIFS('Lista pracowników'!$A$5:$A$3576,'Lista pracowników'!$G$5:$G$3576,R$4,'Lista pracowników'!$B$5:$B$3576,$B60))/(SUM($I60:$N60))),\"-\")","v":"-"},{"$f":"IFERROR(((SUMIFS('Lista pracowników'!$A$5:$A$3576,'Lista pracowników'!$G$5:$G$3576,S$4,'Lista pracowników'!$B$5:$B$3576,$B60))/SUM($I60:$N60)),\"-\")","v":"-"},{"$f":"IFERROR(((SUMIFS('Lista pracowników'!$A$5:$A$3576,'Lista pracowników'!$G$5:$G$3576,T$4,'Lista pracowników'!$B$5:$B$3576,$B60))/SUM($I60:$N60)),\"-\")","v":"-"},{"$f":"IFERROR(((SUMIFS('Lista pracowników'!$A$5:$A$3576,'Lista pracowników'!$G$5:$G$3576,U$4,'Lista pracowników'!$B$5:$B$3576,$B60))/SUM($I60:$N60)),\"-\")","v":"-"}]
[56,null,null,null,null,{"$f":"IF(E61>'Lista pracowników'!$M$4,\"-\",VLOOKUP($E61,'Siatka płac'!$B$6:$E$17,3,FALSE))","v":0},{"$f":"IF(E61>'Lista pracowników'!$M$4,\"-\",VLOOKUP($E61,'Siatka płac'!$B$6:$E$17,4,FALSE))","v":0},{"$f":"SUMIFS('Lista pracowników'!$A$5:$A$8386,'Lista pracowników'!$B$5:$B$8386,$B61)","v":0},{"$f":"SUMIFS('Lista pracowników'!$A$5:$A$3576,'Lista pracowników'!$G$5:$G$3576,I$4,'Lista pracowników'!$B$5:$B$3576,$B61)","v":0},{"$f":"SUMIFS('Lista pracowników'!$A$5:$A$3576,'Lista pracowników'!$G$5:$G$3576,J$4,'Lista pracowników'!$B$5:$B$3576,$B61)","v":0},{"$f":"SUMIFS('Lista pracowników'!$A$5:$A$3576,'Lista pracowników'!$G$5:$G$3576,K$4,'Lista pracowników'!$B$5:$B$3576,$B61)","v":0},{"$f":"SUMIFS('Lista pracowników'!$A$5:$A$3576,'Lista pracowników'!$G$5:$G$3576,L$4,'Lista pracowników'!$B$5:$B$3576,$B61)","v":0},{"$f":"SUMIFS('Lista pracowników'!$A$5:$A$3576,'Lista pracowników'!$G$5:$G$3576,M$4,'Lista pracowników'!$B$5:$B$3576,$B61)","v":0},{"$f":"SUMIFS('Lista pracowników'!$A$5:$A$3576,'Lista pracowników'!$G$5:$G$3576,N$4,'Lista pracowników'!$B$5:$B$3576,$B61)","v":0},null,{"$f":"IFERROR(((SUMIFS('Lista pracowników'!$A$5:$A$3576,'Lista pracowników'!$G$5:$G$3576,P$4,'Lista pracowników'!$B$5:$B$3576,$B61))/SUM($I61:$N61)),\"-\")","v":"-"},{"$f":"IFERROR(((SUMIFS('Lista pracowników'!$A$5:$A$3576,'Lista pracowników'!$G$5:$G$3576,Q$4,'Lista pracowników'!$B$5:$B$3576,$B61))/SUM($I61:$N61)),\"-\")","v":"-"},{"$f":"IFERROR(((SUMIFS('Lista pracowników'!$A$5:$A$3576,'Lista pracowników'!$G$5:$G$3576,R$4,'Lista pracowników'!$B$5:$B$3576,$B61))/(SUM($I61:$N61))),\"-\")","v":"-"},{"$f":"IFERROR(((SUMIFS('Lista pracowników'!$A$5:$A$3576,'Lista pracowników'!$G$5:$G$3576,S$4,'Lista pracowników'!$B$5:$B$3576,$B61))/SUM($I61:$N61)),\"-\")","v":"-"},{"$f":"IFERROR(((SUMIFS('Lista pracowników'!$A$5:$A$3576,'Lista pracowników'!$G$5:$G$3576,T$4,'Lista pracowników'!$B$5:$B$3576,$B61))/SUM($I61:$N61)),\"-\")","v":"-"},{"$f":"IFERROR(((SUMIFS('Lista pracowników'!$A$5:$A$3576,'Lista pracowników'!$G$5:$G$3576,U$4,'Lista pracowników'!$B$5:$B$3576,$B61))/SUM($I61:$N61)),\"-\")","v":"-"}]
[57,null,null,null,null,{"$f":"IF(E62>'Lista pracowników'!$M$4,\"-\",VLOOKUP($E62,'Siatka płac'!$B$6:$E$17,3,FALSE))","v":0},{"$f":"IF(E62>'Lista pracowników'!$M$4,\"-\",VLOOKUP($E62,'Siatka płac'!$B$6:$E$17,4,FALSE))","v":0},{"$f":"SUMIFS('Lista pracowników'!$A$5:$A$8386,'Lista pracowników'!$B$5:$B$8386,$B62)","v":0},{"$f":"SUMIFS('Lista pracowników'!$A$5:$A$3576,'Lista pracowników'!$G$5:$G$3576,I$4,'Lista pracowników'!$B$5:$B$3576,$B62)","v":0},{"$f":"SUMIFS('Lista pracowników'!$A$5:$A$3576,'Lista pracowników'!$G$5:$G$3576,J$4,'Lista pracowników'!$B$5:$B$3576,$B62)","v":0},{"$f":"SUMIFS('Lista pracowników'!$A$5:$A$3576,'Lista pracowników'!$G$5:$G$3576,K$4,'Lista pracowników'!$B$5:$B$3576,$B62)","v":0},{"$f":"SUMIFS('Lista pracowników'!$A$5:$A$3576,'Lista pracowników'!$G$5:$G$3576,L$4,'Lista pracowników'!$B$5:$B$3576,$B62)","v":0},{"$f":"SUMIFS('Lista pracowników'!$A$5:$A$3576,'Lista pracowników'!$G$5:$G$3576,M$4,'Lista pracowników'!$B$5:$B$3576,$B62)","v":0},{"$f":"SUMIFS('Lista pracowników'!$A$5:$A$3576,'Lista pracowników'!$G$5:$G$3576,N$4,'Lista pracowników'!$B$5:$B$3576,$B62)","v":0},null,{"$f":"IFERROR(((SUMIFS('Lista pracowników'!$A$5:$A$3576,'Lista pracowników'!$G$5:$G$3576,P$4,'Lista pracowników'!$B$5:$B$3576,$B62))/SUM($I62:$N62)),\"-\")","v":"-"},{"$f":"IFERROR(((SUMIFS('Lista pracowników'!$A$5:$A$3576,'Lista pracowników'!$G$5:$G$3576,Q$4,'Lista pracowników'!$B$5:$B$3576,$B62))/SUM($I62:$N62)),\"-\")","v":"-"},{"$f":"IFERROR(((SUMIFS('Lista pracowników'!$A$5:$A$3576,'Lista pracowników'!$G$5:$G$3576,R$4,'Lista pracowników'!$B$5:$B$3576,$B62))/(SUM($I62:$N62))),\"-\")","v":"-"},{"$f":"IFERROR(((SUMIFS('Lista pracowników'!$A$5:$A$3576,'Lista pracowników'!$G$5:$G$3576,S$4,'Lista pracowników'!$B$5:$B$3576,$B62))/SUM($I62:$N62)),\"-\")","v":"-"},{"$f":"IFERROR(((SUMIFS('Lista pracowników'!$A$5:$A$3576,'Lista pracowników'!$G$5:$G$3576,T$4,'Lista pracowników'!$B$5:$B$3576,$B62))/SUM($I62:$N62)),\"-\")","v":"-"},{"$f":"IFERROR(((SUMIFS('Lista pracowników'!$A$5:$A$3576,'Lista pracowników'!$G$5:$G$3576,U$4,'Lista pracowników'!$B$5:$B$3576,$B62))/SUM($I62:$N62)),\"-\")","v":"-"}]
[58,null,null,null,null,{"$f":"IF(E63>'Lista pracowników'!$M$4,\"-\",VLOOKUP($E63,'Siatka płac'!$B$6:$E$17,3,FALSE))","v":0},{"$f":"IF(E63>'Lista pracowników'!$M$4,\"-\",VLOOKUP($E63,'Siatka płac'!$B$6:$E$17,4,FALSE))","v":0},{"$f":"SUMIFS('Lista pracowników'!$A$5:$A$8386,'Lista pracowników'!$B$5:$B$8386,$B63)","v":0},{"$f":"SUMIFS('Lista pracowników'!$A$5:$A$3576,'Lista pracowników'!$G$5:$G$3576,I$4,'Lista pracowników'!$B$5:$B$3576,$B63)","v":0},{"$f":"SUMIFS('Lista pracowników'!$A$5:$A$3576,'Lista pracowników'!$G$5:$G$3576,J$4,'Lista pracowników'!$B$5:$B$3576,$B63)","v":0},{"$f":"SUMIFS('Lista pracowników'!$A$5:$A$3576,'Lista pracowników'!$G$5:$G$3576,K$4,'Lista pracowników'!$B$5:$B$3576,$B63)","v":0},{"$f":"SUMIFS('Lista pracowników'!$A$5:$A$3576,'Lista pracowników'!$G$5:$G$3576,L$4,'Lista pracowników'!$B$5:$B$3576,$B63)","v":0},{"$f":"SUMIFS('Lista pracowników'!$A$5:$A$3576,'Lista pracowników'!$G$5:$G$3576,M$4,'Lista pracowników'!$B$5:$B$3576,$B63)","v":0},{"$f":"SUMIFS('Lista pracowników'!$A$5:$A$3576,'Lista pracowników'!$G$5:$G$3576,N$4,'Lista pracowników'!$B$5:$B$3576,$B63)","v":0},null,{"$f":"IFERROR(((SUMIFS('Lista pracowników'!$A$5:$A$3576,'Lista pracowników'!$G$5:$G$3576,P$4,'Lista pracowników'!$B$5:$B$3576,$B63))/SUM($I63:$N63)),\"-\")","v":"-"},{"$f":"IFERROR(((SUMIFS('Lista pracowników'!$A$5:$A$3576,'Lista pracowników'!$G$5:$G$3576,Q$4,'Lista pracowników'!$B$5:$B$3576,$B63))/SUM($I63:$N63)),\"-\")","v":"-"},{"$f":"IFERROR(((SUMIFS('Lista pracowników'!$A$5:$A$3576,'Lista pracowników'!$G$5:$G$3576,R$4,'Lista pracowników'!$B$5:$B$3576,$B63))/(SUM($I63:$N63))),\"-\")","v":"-"},{"$f":"IFERROR(((SUMIFS('Lista pracowników'!$A$5:$A$3576,'Lista pracowników'!$G$5:$G$3576,S$4,'Lista pracowników'!$B$5:$B$3576,$B63))/SUM($I63:$N63)),\"-\")","v":"-"},{"$f":"IFERROR(((SUMIFS('Lista pracowników'!$A$5:$A$3576,'Lista pracowników'!$G$5:$G$3576,T$4,'Lista pracowników'!$B$5:$B$3576,$B63))/SUM($I63:$N63)),\"-\")","v":"-"},{"$f":"IFERROR(((SUMIFS('Lista pracowników'!$A$5:$A$3576,'Lista pracowników'!$G$5:$G$3576,U$4,'Lista pracowników'!$B$5:$B$3576,$B63))/SUM($I63:$N63)),\"-\")","v":"-"}]
[59,null,null,null,null,{"$f":"IF(E64>'Lista pracowników'!$M$4,\"-\",VLOOKUP($E64,'Siatka płac'!$B$6:$E$17,3,FALSE))","v":0},{"$f":"IF(E64>'Lista pracowników'!$M$4,\"-\",VLOOKUP($E64,'Siatka płac'!$B$6:$E$17,4,FALSE))","v":0},{"$f":"SUMIFS('Lista pracowników'!$A$5:$A$8386,'Lista pracowników'!$B$5:$B$8386,$B64)","v":0},{"$f":"SUMIFS('Lista pracowników'!$A$5:$A$3576,'Lista pracowników'!$G$5:$G$3576,I$4,'Lista pracowników'!$B$5:$B$3576,$B64)","v":0},{"$f":"SUMIFS('Lista pracowników'!$A$5:$A$3576,'Lista pracowników'!$G$5:$G$3576,J$4,'Lista pracowników'!$B$5:$B$3576,$B64)","v":0},{"$f":"SUMIFS('Lista pracowników'!$A$5:$A$3576,'Lista pracowników'!$G$5:$G$3576,K$4,'Lista pracowników'!$B$5:$B$3576,$B64)","v":0},{"$f":"SUMIFS('Lista pracowników'!$A$5:$A$3576,'Lista pracowników'!$G$5:$G$3576,L$4,'Lista pracowników'!$B$5:$B$3576,$B64)","v":0},{"$f":"SUMIFS('Lista pracowników'!$A$5:$A$3576,'Lista pracowników'!$G$5:$G$3576,M$4,'Lista pracowników'!$B$5:$B$3576,$B64)","v":0},{"$f":"SUMIFS('Lista pracowników'!$A$5:$A$3576,'Lista pracowników'!$G$5:$G$3576,N$4,'Lista pracowników'!$B$5:$B$3576,$B64)","v":0},null,{"$f":"IFERROR(((SUMIFS('Lista pracowników'!$A$5:$A$3576,'Lista pracowników'!$G$5:$G$3576,P$4,'Lista pracowników'!$B$5:$B$3576,$B64))/SUM($I64:$N64)),\"-\")","v":"-"},{"$f":"IFERROR(((SUMIFS('Lista pracowników'!$A$5:$A$3576,'Lista pracowników'!$G$5:$G$3576,Q$4,'Lista pracowników'!$B$5:$B$3576,$B64))/SUM($I64:$N64)),\"-\")","v":"-"},{"$f":"IFERROR(((SUMIFS('Lista pracowników'!$A$5:$A$3576,'Lista pracowników'!$G$5:$G$3576,R$4,'Lista pracowników'!$B$5:$B$3576,$B64))/(SUM($I64:$N64))),\"-\")","v":"-"},{"$f":"IFERROR(((SUMIFS('Lista pracowników'!$A$5:$A$3576,'Lista pracowników'!$G$5:$G$3576,S$4,'Lista pracowników'!$B$5:$B$3576,$B64))/SUM($I64:$N64)),\"-\")","v":"-"},{"$f":"IFERROR(((SUMIFS('Lista pracowników'!$A$5:$A$3576,'Lista pracowników'!$G$5:$G$3576,T$4,'Lista pracowników'!$B$5:$B$3576,$B64))/SUM($I64:$N64)),\"-\")","v":"-"},{"$f":"IFERROR(((SUMIFS('Lista pracowników'!$A$5:$A$3576,'Lista pracowników'!$G$5:$G$3576,U$4,'Lista pracowników'!$B$5:$B$3576,$B64))/SUM($I64:$N64)),\"-\")","v":"-"}]
[60,null,null,null,null,{"$f":"IF(E65>'Lista pracowników'!$M$4,\"-\",VLOOKUP($E65,'Siatka płac'!$B$6:$E$17,3,FALSE))","v":0},{"$f":"IF(E65>'Lista pracowników'!$M$4,\"-\",VLOOKUP($E65,'Siatka płac'!$B$6:$E$17,4,FALSE))","v":0},{"$f":"SUMIFS('Lista pracowników'!$A$5:$A$8386,'Lista pracowników'!$B$5:$B$8386,$B65)","v":0},{"$f":"SUMIFS('Lista pracowników'!$A$5:$A$3576,'Lista pracowników'!$G$5:$G$3576,I$4,'Lista pracowników'!$B$5:$B$3576,$B65)","v":0},{"$f":"SUMIFS('Lista pracowników'!$A$5:$A$3576,'Lista pracowników'!$G$5:$G$3576,J$4,'Lista pracowników'!$B$5:$B$3576,$B65)","v":0},{"$f":"SUMIFS('Lista pracowników'!$A$5:$A$3576,'Lista pracowników'!$G$5:$G$3576,K$4,'Lista pracowników'!$B$5:$B$3576,$B65)","v":0},{"$f":"SUMIFS('Lista pracowników'!$A$5:$A$3576,'Lista pracowników'!$G$5:$G$3576,L$4,'Lista pracowników'!$B$5:$B$3576,$B65)","v":0},{"$f":"SUMIFS('Lista pracowników'!$A$5:$A$3576,'Lista pracowników'!$G$5:$G$3576,M$4,'Lista pracowników'!$B$5:$B$3576,$B65)","v":0},{"$f":"SUMIFS('Lista pracowników'!$A$5:$A$3576,'Lista pracowników'!$G$5:$G$3576,N$4,'Lista pracowników'!$B$5:$B$3576,$B65)","v":0},null,{"$f":"IFERROR(((SUMIFS('Lista pracowników'!$A$5:$A$3576,'Lista pracowników'!$G$5:$G$3576,P$4,'Lista pracowników'!$B$5:$B$3576,$B65))/SUM($I65:$N65)),\"-\")","v":"-"},{"$f":"IFERROR(((SUMIFS('Lista pracowników'!$A$5:$A$3576,'Lista pracowników'!$G$5:$G$3576,Q$4,'Lista pracowników'!$B$5:$B$3576,$B65))/SUM($I65:$N65)),\"-\")","v":"-"},{"$f":"IFERROR(((SUMIFS('Lista pracowników'!$A$5:$A$3576,'Lista pracowników'!$G$5:$G$3576,R$4,'Lista pracowników'!$B$5:$B$3576,$B65))/(SUM($I65:$N65))),\"-\")","v":"-"},{"$f":"IFERROR(((SUMIFS('Lista pracowników'!$A$5:$A$3576,'Lista pracowników'!$G$5:$G$3576,S$4,'Lista pracowników'!$B$5:$B$3576,$B65))/SUM($I65:$N65)),\"-\")","v":"-"},{"$f":"IFERROR(((SUMIFS('Lista pracowników'!$A$5:$A$3576,'Lista pracowników'!$G$5:$G$3576,T$4,'Lista pracowników'!$B$5:$B$3576,$B65))/SUM($I65:$N65)),\"-\")","v":"-"},{"$f":"IFERROR(((SUMIFS('Lista pracowników'!$A$5:$A$3576,'Lista pracowników'!$G$5:$G$3576,U$4,'Lista pracowników'!$B$5:$B$3576,$B65))/SUM($I65:$N65)),\"-\")","v":"-"}]

{"sheet":"Zestawienie objaśnienia","index":4,"n_rows":23,"n_cols":21,"rows_kept":23,"cut":false,"hidden":false,"merged":[[2,15,2,20],[0,9,1,20],[0,1,0,3],[0,5,0,6],[1,5,2,6],[1,7,2,7],[2,8,2,13],[19,3,22,3],[11,2,13,3],[11,5,11,7],[15,3,18,7],[11,9,12,20],[13,9,15,20]]}
[null,"Zestawienie stanowisk",null,null,null,"Od którego miesiąca wprowadza się siatkę:",null,12,null,"Koszt jednorazowego podniesienia wynagrodzenia pracownikom, którzy są poniżej wynagrodzenia minimalnego w swojej kategorii.\nKoszt \"roczny\" zależy do miesiąca wdrożenia siatki. Np. jeśli to lipiec to koszt podniesienia wynagrodzeń do minimium mnożony jest przez 6"]
[null,null,null,null,null,"Koszt wdrożenia siatki płac do końca roku bieżącego:",null,{"$f":"SUM('Lista pracowników'!$H$5:$H$650)","v":700}]
[null,"Menu","Siatka płac","Zestawienie stanowisk",null,null,null,null,"Liczebności pracowników w kwartylach ",null,null,null,null,null,null,"% liczeność pracowników w kwartylach "]
[null,"tekst",{"$f":"MAX('Siatka płac'!B6:B17)","v":7},null,null,null,null,null,"poniżej min.","I","II","III","IV","powyżej maks.",null,"poniżej min.","I","II","III","IV","powyżej maks."]
["Lp","Stanowisko","Pion","Poziom stanowiska","Kategoria zaszeregowania","Minimum\nkategorii w\nsiatce płac","Maksimum\nkategorii w\nsiatce płac","Liczba pracowników na stanowisku",2,89,81,104,65,83,null,4.7169811320754715E-3,0.2099056603773585,0.19103773584905662,0.24528301886792453,0.15330188679245282,0.19575471698113209]
[1,"Monter",null,null,1,2000,4000,158,1,59,31,67,0,0,null,6.3291139240506328E-3,0.37341772151898733,0.19620253164556961,0.42405063291139239,0,0]
[2,"Operator",null,null,8,2000,4000,50,0,30,13,6,1,0,null,0,0.6,0.26,0.12,0.02,0]
[]
[]
[]
[]
[null,null,"Pola edytowalne\nDla ułatwienia przy ustalaniu Siatki Płac\nmożna pokategoryzować dowolnie stanowiska",null,null,"Dane wyliczane automatycznie",null,null,null,"Statystyki rozkładu wynagrodzeń pracowników w przypisanej kategorii zaszeregownia pozwolą optymalnie dopasować kategorie zaszeregowania do stanowiska."]
[]
[]
[]
[null,null,null,"Pole edytowalne\nWyższy numer kategorii zaszeregowania oznacza wyższe wynagrodzenie.\nRozpiętość i zakresy kategorii zaszeregowania określa się w zakładce \"Siatka Płac\""]
[]
[]
[]
[null,null,null,8,"czerwony kolor oznacza, że nie ma danych dla tej kategorii zaszeregowania"]
[null,null,null,null,"Należy w zakładce \"Siatka Płac\" określić parametry dla tej kategorii"]
[null,null,null,null,"lub"]
[null,null,null,null,"w tym miejscu wpisać numer kategorii z określonymi już parametrami"]

{"sheet":"Siatka płac","index":5,"n_rows":22,"n_cols":5,"rows_kept":22,"cut":false,"hidden":false,"merged":[[0,1,0,4]]}
[null,"Siatka płac"]
[]
[null,"Zestawienie stanowisk",null,"Lista pracowników","Menu"]
[]
[null,"Kategoria zaszeregowania","Rozpiętość kategorii","Minimum\nkategorii","Maximum\nkategorii"]
[null,{"$f":"IF(NOT(OR(ISBLANK(C6),ISBLANK(D6))),1,0)","v":1},2000,2000,{"$f":"D6+C6","v":4000}]
[null,{"$f":"IF(NOT(AND(ISBLANK(C7),ISBLANK(D7))),1+B6,0)","v":2},2200,2500,{"$f":"D7+C7","v":4700}]
[null,3,2500,3000,5500]
[null,4,2800,3200,6000]
[null,5,3000,3500,6500]
[null,6,3200,3800,7000]
[null,7,4000,5000,9000]
[null,{"$f":"IF(NOT(AND(ISBLANK(C13),ISBLANK(D13))),1+B12,0)","v":0},null,null,0]
[null,0,null,null,0]
[null,0,null,null,0]
[null,0,null,null,0]
[null,0,null,null,0]
[]
[]
[null,null,"pola edytowalne"]
[]
[null,12," - maksymalna liczba kategorii zaszeregowania"]