{"text_format":"1","workbook":"xlsx","n_sheets":6,"sheets":["Start","Lista pracowników","Lista objaśnienia","Zestawienie stanowisk","Zestawienie objaśnienia","Siatka płac"],"not_rendered":{"charts":1,"images":0,"macros":1,"external_links":0,"defined_names":7,"comments":0,"pivot_tables":0},"unopened":[],"bounds":{"document_bytes":16777216,"sheet_cells":100000,"rows_first":2000,"rows_last":500,"rows_between":2000,"halvings":0,"cell_chars":16384,"cell_head_chars":4096},"cells_cut":0,"cells_raw":0,"read":"whole","date_system":"1900"}

{"sheet":"Start","index":0,"n_rows":24,"n_cols":10,"rows_kept":24,"cut":false,"hidden":false,"merged":[[7,2,7,11],[4,2,4,11],[13,2,13,4],[13,5,13,8],[1,1,1,11],[8,2,8,11],[5,2,5,11],[6,2,6,11],[18,2,18,11],[11,9,11,10],[11,5,11,7],[11,2,11,4],[15,2,15,11],[16,2,16,4],[16,6,16,7],[16,9,16,11]]}
[]
[null,"Siatka płac"]
[]
[]
[null,"J","Jak używać pliku:"]
[null,1,"Zasilić zakładkę danymi zakładkę „Lista pracowników”"]
[null,2,"Przypisać stanowiskom w „Zestawieniu stanowisk” numer kategorii zaszeregowania"]
[null,3,"Wpisać miminum kategorii zaszeregowania i ich rozpiętość w „Siatce płac”"]
[null,4,"Edytując watrości w zakładce \"Siatka Płac\" oraz numery kategorii zaszeregowania w zakładce \"Zestawienie stanowisk\" przeprowadzamy symulacje zmian w siatce płac w organizacji"]
[]
{"$rows_left_out":15}
{"sheet":"Lista pracowników","index":1,"n_rows":600,"n_cols":14,"rows_kept":600,"cut":false,"hidden":false,"merged":[[2,5,2,6],[0,1,0,3]]}
[null,"Lista pracowników",null,null,null,null,"Liczba pracowników:",{"$f":"SUM(A5:A600)","v":426}]
[null,"Zestawienie stanowisk","Siatka płac","Menu","Objaśnienia"]
[]
["po","Stanowisko","Wynagrodzenie zasadnicze brutto","Nazwisko i imię pracownika","Kategoria zaszeregowania","wartość compa ratio\n(miejsce w siatce płac)","Kwartyl w \nsiatce płac","koszt miesięczny \"podciągnięcia\" do minimum kategorii",null,null,null,null,{"$f":"MAX('Siatka płac'!B6:B17)","v":7}]
[{"$f":"IF(ISBLANK(B5),0,1)","v":1},"Monter",1500,"Pracownik 1",{"$f":"IFERROR((VLOOKUP(B5,'Zestawienie stanowisk'!$B$5:$E$65,4,FALSE)),\"-\")","v":1},{"$f":"IFERROR(((C5-(VLOOKUP(E5,'Siatka płac'!$B$6:$E$17,3,FALSE)))/(VLOOKUP(E5,'Siatka płac'!$B$6:$E$17,4,FALSE)-VLOOKUP(E5,'Siatka płac'!$B$6:$E$17,3,FALSE))),\"-\")","v":-0.25},{"$f":"IFERROR((INDEX($N$5:$N$10,MATCH(F5,$M$5:$M$10,-1))),\"-\")","v":"poniżej min."},{"$f":"IF(G5=\"poniżej min.\",((VLOOKUP(E5,'Siatka płac'!$B$6:$D$17,3,FALSE)-C5)*(13-'Zestawienie stanowisk'!$H$1)),\"-\")","v":500},null,null,null,null,10,"powyżej maks."]
[1,"Operator",2300,"Pracownik 2",{"$f":"IFERROR((VLOOKUP(B6,'Zestawienie stanowisk'!$B$5:$E$65,4,FALSE)),\"-\")","v":1},{"$f":"IFERROR(((C6-(VLOOKUP(E6,'Siatka płac'!$B$6:$E$17,3,FALSE)))/(VLOOKUP(E6,'Siatka płac'!$B$6:$E$17,4,FALSE)-VLOOKUP(E6,'Siatka płac'!$B$6:$E$17,3,FALSE))),\"-\")","v":0.15},"I",{"$f":"IF(G6=\"poniżej min.\",((VLOOKUP(E6,'Siatka płac'!$B$6:$D$17,3,FALSE)-C6)*(13-'Zestawienie stanowisk'!$H$1)),\"-\")","v":"-"},null,null,null,null,1,"IV"]
[1,"Spawacz",3500,"Pracownik 3",{"$f":"IFERROR((VLOOKUP(B7,'Zestawienie stanowisk'!$B$5:$E$65,4,FALSE)),\"-\")","v":1},{"$f":"IFERROR(((C7-(VLOOKUP(E7,'Siatka płac'!$B$6:$E$17,3,FALSE)))/(VLOOKUP(E7,'Siatka płac'!$B$6:$E$17,4,FALSE)-VLOOKUP(E7,'Siatka płac'!$B$6:$E$17,3,FALSE))),\"-\")","v":0.75},"III",{"$f":"IF(G7=\"poniżej min.\",((VLOOKUP(E7,'Siatka płac'!$B$6:$D$17,3,FALSE)-C7)*(13-'Zestawienie stanowisk'!$H$1)),\"-\")","v":"-"},null,null,null,null,0.75,"III"]
[1,"Mechanik",1800,"Pracownik 4",{"$f":"IFERROR((VLOOKUP(B8,'Zestawienie stanowisk'!$B$5:$E$65,4,FALSE)),\"-\")","v":1},{"$f":"IFERROR(((C8-(VLOOKUP(E8,'Siatka płac'!$B$6:$E$17,3,FALSE)))/(VLOOKUP(E8,'Siatka płac'!$B$6:$E$17,4,FALSE)-VLOOKUP(E8,'Siatka płac'!$B$6:$E$17,3,FALSE))),\"-\")","v":-0.1},"poniżej min.",{"$f":"IF(G8=\"poniżej min.\",((VLOOKUP(E8,'Siatka płac'!$B$6:$D$17,3,FALSE)-C8)*(13-'Zestawienie stanowisk'!$H$1)),\"-\")","v":200},null,null,null,null,0.5,"II"]
[1,"Elektryk",4500,"Pracownik 5",{"$f":"IFERROR((VLOOKUP(B9,'Zestawienie stanowisk'!$B$5:$E$65,4,FALSE)),\"-\")","v":1},{"$f":"IFERROR(((C9-(VLOOKUP(E9,'Siatka płac'!$B$6:$E$17,3,FALSE)))/(VLOOKUP(E9,'Siatka płac'!$B$6:$E$17,4,FALSE)-VLOOKUP(E9,'Siatka płac'!$B$6:$E$17,3,FALSE))),\"-\")","v":1.25},"powyżej maks.",{"$f":"IF(G9=\"poniżej min.\",((VLOOKUP(E9,'Siatka płac'!$B$6:$D$17,3,FALSE)-C9)*(13-'Zestawienie stanowisk'!$H$1)),\"-\")","v":"-"},null,null,null,null,0.25,"I"]
[1,"Kierowca",3000,"Pracownik 6",{"$f":"IFERROR((VLOOKUP(B10,'Zestawienie stanowisk'!$B$5:$E$65,4,FALSE)),\"-\")","v":1},{"$f":"IFERROR(((C10-(VLOOKUP(E10,'Siatka płac'!$B$6:$E$17,3,FALSE)))/(VLOOKUP(E10,'Siatka płac'!$B$6:$E$17,4,FALSE)-VLOOKUP(E10,'Siatka płac'!$B$6:$E$17,3,FALSE))),\"-\")","v":0.5},"II",{"$f":"IF(G10=\"poniżej min.\",((VLOOKUP(E10,'Siatka płac'!$B$6:$D$17,3,FALSE)-C10)*(13-'Zestawienie stanowisk'!$H$1)),\"-\")","v":"-"},null,null,null,null,0,"poniżej min."]
{"$rows_left_out":591}
{"sheet":"Lista objaśnienia","index":2,"n_rows":14,"n_cols":14,"rows_kept":14,"cut":false,"hidden":false,"merged":[[0,1,0,3],[2,5,2,6],[10,1,11,3],[10,7,16,7],[13,3,17,5],[1,3,2,4]]}
[null,"Lista pracowników",null,null,null,null,"Liczba pracowników:",{"$f":"SUM(A5:A7)","v":3}]
[null,"Lista pracowników","Menu","Przycisk uruchamiający makro, które zasili nazwami stanowisk zakładkę \"Zestawienie stanowisk\"   (uruchamiane raz)"]
[]
["po","Stanowisko","Wynagrodzenie zasadnicze brutto","Nazwisko i imię pracownika","Kategoria zaszeregowania","wartość compa ratio\n(miejsce w siatce płac)","Kwartyl w \nsiatce płac","koszt miesięczny \"podciągnięcia\" do minimum kategorii",null,null,null,null,{"$f":"MAX('Siatka płac'!B6:B17)","v":7}]
[1,"Monter",1500,"Pracownik 1",1,-0.25,"poniżej min.",500,null,null,null,null,10,"powyżej maks."]
[1,"Operator",2300,"Pracownik 2",1,0.15,"I","-",null,null,null,null,1,"IV"]
[1,"Elektryk",4500,"Pracownik 5",1,1.25,"powyżej maks.","-",null,null,null,null,0.25,"I"]
[]
[]
[]
{"$rows_left_out":5}
{"sheet":"Zestawienie stanowisk","index":3,"n_rows":65,"n_cols":21,"rows_kept":65,"cut":false,"hidden":false,"merged":[[2,8,2,13],[2,15,2,20],[0,1,0,3],[0,5,0,6],[1,5,2,6],[1,7,2,7]]}
[null,"Zestawienie stanowisk",null,null,null,"Od którego miesiąca wprowadza się siatkę:",null,12]
[null,null,null,null,null,"Koszt wdrożenia siatki płac do końca roku bieżącego:",null,{"$f":"SUM('Lista pracowników'!$H$5:$H$650)","v":700}]
[null,"Objaśnienia","Siatka płac","Lista pracowników","Menu",null,null,null,"Liczebności pracowników w kwartylach ",null,null,null,null,null,null,"% liczeności pracowników w kwartylach "]
[null,"tekst",{"$f":"MAX('Siatka płac'!B6:B17)","v":7},null,null,null,null,null,"poniżej min.","I","II","III","IV","powyżej maks.",null,"poniżej min.","I","II","III","IV","powyżej maks."]
["Lp","Stanowisko","Pion","Poziom stanowiska","Kategoria zaszeregowania","Minimum\nkategorii w\nsiatce płac","Maksimum\nkategorii w\nsiatce płac","Liczba pracowników na stanowisku",{"$f":"SUM(I6:I261)","v":2},89,81,104,65,83,null,{"$f":"I5/SUM($I5:$N5)","v":4.7169811320754715E-3},{"$f":"J5/SUM($I5:$N5)","v":0.2099056603773585},0.19103773584905662,0.24528301886792453,0.15330188679245282,0.19575471698113209]
[1,"Monter",null,null,1,{"$f":"IF(E6>'Lista pracowników'!$M$4,\"-\",VLOOKUP($E6,'Siatka płac'!$B$6:$E$17,3,FALSE))","v":2000},{"$f":"IF(E6>'Lista pracowników'!$M$4,\"-\",VLOOKUP($E6,'Siatka płac'!$B$6:$E$17,4,FALSE))","v":4000},{"$f":"SUMIFS('Lista pracowników'!$A$5:$A$8578,'Lista pracowników'!$B$5:$B$8578,$B6)","v":158},{"$f":"SUMIFS('Lista pracowników'!$A$5:$A$3576,'Lista pracowników'!$G$5:$G$3576,I$4,'Lista pracowników'!$B$5:$B$3576,$B6)","v":1},{"$f":"SUMIFS('Lista pracowników'!$A$5:$A$3576,'Lista pracowników'!$G$5:$G$3576,J$4,'Lista pracowników'!$B$5:$B$3576,$B6)","v":59},{"$f":"SUMIFS('Lista pracowników'!$A$5:$A$3576,'Lista pracowników'!$G$5:$G$3576,K$4,'Lista pracowników'!$B$5:$B$3576,$B6)","v":31},{"$f":"SUMIFS('Lista pracowników'!$A$5:$A$3576,'Lista pracowników'!$G$5:$G$3576,L$4,'Lista pracowników'!$B$5:$B$3576,$B6)","v":67},{"$f":"SUMIFS('Lista pracowników'!$A$5:$A$3576,'Lista pracowników'!$G$5:$G$3576,M$4,'Lista pracowników'!$B$5:$B$3576,$B6)","v":0},{"$f":"SUMIFS('Lista pracowników'!$A$5:$A$3576,'Lista pracowników'!$G$5:$G$3576,N$4,'Lista pracowników'!$B$5:$B$3576,$B6)","v":0},null,{"$f":"IFERROR(((SUMIFS('Lista pracowników'!$A$5:$A$3576,'Lista pracowników'!$G$5:$G$3576,P$4,'Lista pracowników'!$B$5:$B$3576,$B6))/SUM($I6:$N6)),\"-\")","v":6.3291139240506328E-3},{"$f":"IFERROR(((SUMIFS('Lista pracowników'!$A$5:$A$3576,'Lista pracowników'!$G$5:$G$3576,Q$4,'Lista pracowników'!$B$5:$B$3576,$B6))/SUM($I6:$N6)),\"-\")","v":0.37341772151898733},{"$f":"IFERROR(((SUMIFS('Lista pracowników'!$A$5:$A$3576,'Lista pracowników'!$G$5:$G$3576,R$4,'Lista pracowników'!$B$5:$B$3576,$B6))/(SUM($I6:$N6))),\"-\")","v":0.19620253164556961},{"$f":"IFERROR(((SUMIFS('Lista pracowników'!$A$5:$A$3576,'Lista pracowników'!$G$5:$G$3576,S$4,'Lista pracowników'!$B$5:$B$3576,$B6))/SUM($I6:$N6)),\"-\")","v":0.42405063291139239},{"$f":"IFERROR(((SUMIFS('Lista pracowników'!$A$5:$A$3576,'Lista pracowników'!$G$5:$G$3576,T$4,'Lista pracowników'!$B$5:$B$3576,$B6))/SUM($I6:$N6)),\"-\")","v":0},{"$f":"IFERROR(((SUMIFS('Lista pracowników'!$A$5:$A$3576,'Lista pracowników'!$G$5:$G$3576,U$4,'Lista pracowników'!$B$5:$B$3576,$B6))/SUM($I6:$N6)),\"-\")","v":0}]
[2,"Operator",null,null,1,{"$f":"IF(E7>'Lista pracowników'!$M$4,\"-\",VLOOKUP($E7,'Siatka płac'!$B$6:$E$17,3,FALSE))","v":2000},{"$f":"IF(E7>'Lista pracowników'!$M$4,\"-\",VLOOKUP($E7,'Siatka płac'!$B$6:$E$17,4,FALSE))","v":4000},{"$f":"SUMIFS('Lista pracowników'!$A$5:$A$8386,'Lista pracowników'!$B$5:$B$8386,$B7)","v":50},{"$f":"SUMIFS('Lista pracowników'!$A$5:$A$3576,'Lista pracowników'!$G$5:$G$3576,I$4,'Lista pracowników'!$B$5:$B$3576,$B7)","v":0},{"$f":"SUMIFS('Lista pracowników'!$A$5:$A$3576,'Lista pracowników'!$G$5:$G$3576,J$4,'Lista pracowników'!$B$5:$B$3576,$B7)","v":30},{"$f":"SUMIFS('Lista pracowników'!$A$5:$A$3576,'Lista pracowników'!$G$5:$G$3576,K$4,'Lista pracowników'!$B$5:$B$3576,$B7)","v":13},{"$f":"SUMIFS('Lista pracowników'!$A$5:$A$3576,'Lista pracowników'!$G$5:$G$3576,L$4,'Lista pracowników'!$B$5:$B$3576,$B7)","v":6},{"$f":"SUMIFS('Lista pracowników'!$A$5:$A$3576,'Lista pracowników'!$G$5:$G$3576,M$4,'Lista pracowników'!$B$5:$B$3576,$B7)","v":1},{"$f":"SUMIFS('Lista pracowników'!$A$5:$A$3576,'Lista pracowników'!$G$5:$G$3576,N$4,'Lista pracowników'!$B$5:$B$3576,$B7)","v":0},null,{"$f":"IFERROR(((SUMIFS('Lista pracowników'!$A$5:$A$3576,'Lista pracowników'!$G$5:$G$3576,P$4,'Lista pracowników'!$B$5:$B$3576,$B7))/SUM($I7:$N7)),\"-\")","v":0},{"$f":"IFERROR(((SUMIFS('Lista pracowników'!$A$5:$A$3576,'Lista pracowników'!$G$5:$G$3576,Q$4,'Lista pracowników'!$B$5:$B$3576,$B7))/SUM($I7:$N7)),\"-\")","v":0.6},{"$f":"IFERROR(((SUMIFS('Lista pracowników'!$A$5:$A$3576,'Lista pracowników'!$G$5:$G$3576,R$4,'Lista pracowników'!$B$5:$B$3576,$B7))/(SUM($I7:$N7))),\"-\")","v":0.26},{"$f":"IFERROR(((SUMIFS('Lista pracowników'!$A$5:$A$3576,'Lista pracowników'!$G$5:$G$3576,S$4,'Lista pracowników'!$B$5:$B$3576,$B7))/SUM($I7:$N7)),\"-\")","v":0.12},{"$f":"IFERROR(((SUMIFS('Lista pracowników'!$A$5:$A$3576,'Lista pracowników'!$G$5:$G$3576,T$4,'Lista pracowników'!$B$5:$B$3576,$B7))/SUM($I7:$N7)),\"-\")","v":0.02},{"$f":"IFERROR(((SUMIFS('Lista pracowników'!$A$5:$A$3576,'Lista pracowników'!$G$5:$G$3576,U$4,'Lista pracowników'!$B$5:$B$3576,$B7))/SUM($I7:$N7)),\"-\")","v":0}]
[3,"Spawacz",null,null,1,{"$f":"IF(E8>'Lista pracowników'!$M$4,\"-\",VLOOKUP($E8,'Siatka płac'!$B$6:$E$17,3,FALSE))","v":2000},{"$f":"IF(E8>'Lista pracowników'!$M$4,\"-\",VLOOKUP($E8,'Siatka płac'!$B$6:$E$17,4,FALSE))","v":4000},{"$f":"SUMIFS('Lista pracowników'!$A$5:$A$8386,'Lista pracowników'!$B$5:$B$8386,$B8)","v":41},{"$f":"SUMIFS('Lista pracowników'!$A$5:$A$3576,'Lista pracowników'!$G$5:$G$3576,I$4,'Lista pracowników'!$B$5:$B$3576,$B8)","v":0},{"$f":"SUMIFS('Lista pracowników'!$A$5:$A$3576,'Lista pracowników'!$G$5:$G$3576,J$4,'Lista pracowników'!$B$5:$B$3576,$B8)","v":0},{"$f":"SUMIFS('Lista pracowników'!$A$5:$A$3576,'Lista pracowników'!$G$5:$G$3576,K$4,'Lista pracowników'!$B$5:$B$3576,$B8)","v":0},{"$f":"SUMIFS('Lista pracowników'!$A$5:$A$3576,'Lista pracowników'!$G$5:$G$3576,L$4,'Lista pracowników'!$B$5:$B$3576,$B8)","v":11},{"$f":"SUMIFS('Lista pracowników'!$A$5:$A$3576,'Lista pracowników'!$G$5:$G$3576,M$4,'Lista pracowników'!$B$5:$B$3576,$B8)","v":12},{"$f":"SUMIFS('Lista pracowników'!$A$5:$A$3576,'Lista pracowników'!$G$5:$G$3576,N$4,'Lista pracowników'!$B$5:$B$3576,$B8)","v":18},null,{"$f":"IFERROR(((SUMIFS('Lista pracowników'!$A$5:$A$3576,'Lista pracowników'!$G$5:$G$3576,P$4,'Lista pracowników'!$B$5:$B$3576,$B8))/SUM($I8:$N8)),\"-\")","v":0},{"$f":"IFERROR(((SUMIFS('Lista pracowników'!$A$5:$A$3576,'Lista pracowników'!$G$5:$G$3576,Q$4,'Lista pracowników'!$B$5:$B$3576,$B8))/SUM($I8:$N8)),\"-\")","v":0},{"$f":"IFERROR(((SUMIFS('Lista pracowników'!$A$5:$A$3576,'Lista pracowników'!$G$5:$G$3576,R$4,'Lista pracowników'!$B$5:$B$3576,$B8))/(SUM($I8:$N8))),\"-\")","v":0},{"$f":"IFERROR(((SUMIFS('Lista pracowników'!$A$5:$A$3576,'Lista pracowników'!$G$5:$G$3576,S$4,'Lista pracowników'!$B$5:$B$3576,$B8))/SUM($I8:$N8)),\"-\")","v":0.26829268292682928},{"$f":"IFERROR(((SUMIFS('Lista pracowników'!$A$5:$A$3576,'Lista pracowników'!$G$5:$G$3576,T$4,'Lista pracowników'!$B$5:$B$3576,$B8))/SUM($I8:$N8)),\"-\")","v":0.29268292682926828},{"$f":"IFERROR(((SUMIFS('Lista pracowników'!$A$5:$A$3576,'Lista pracowników'!$G$5:$G$3576,U$4,'Lista pracowników'!$B$5:$B$3576,$B8))/SUM($I8:$N8)),\"-\")","v":0.43902439024390244}]
[4,"Mechanik",null,null,1,{"$f":"IF(E9>'Lista pracowników'!$M$4,\"-\",VLOOKUP($E9,'Siatka płac'!$B$6:$E$17,3,FALSE))","v":2000},{"$f":"IF(E9>'Lista pracowników'!$M$4,\"-\",VLOOKUP($E9,'Siatka płac'!$B$6:$E$17,4,FALSE))","v":4000},{"$f":"SUMIFS('Lista pracowników'!$A$5:$A$8386,'Lista pracowników'!$B$5:$B$8386,$B9)","v":18},{"$f":"SUMIFS('Lista pracowników'!$A$5:$A$3576,'Lista pracowników'!$G$5:$G$3576,I$4,'Lista pracowników'!$B$5:$B$3576,$B9)","v":1},{"$f":"SUMIFS('Lista pracowników'!$A$5:$A$3576,'Lista pracowników'!$G$5:$G$3576,J$4,'Lista pracowników'!$B$5:$B$3576,$B9)","v":0},{"$f":"SUMIFS('Lista pracowników'!$A$5:$A$3576,'Lista pracowników'!$G$5:$G$3576,K$4,'Lista pracowników'!$B$5:$B$3576,$B9)","v":0},{"$f":"SUMIFS('Lista pracowników'!$A$5:$A$3576,'Lista pracowników'!$G$5:$G$3576,L$4,'Lista pracowników'!$B$5:$B$3576,$B9)","v":4},{"$f":"SUMIFS('Lista pracowników'!$A$5:$A$3576,'Lista pracowników'!$G$5:$G$3576,M$4,'Lista pracowników'!$B$5:$B$3576,$B9)","v":9},{"$f":"SUMIFS('Lista pracowników'!$A$5:$A$3576,'Lista pracowników'!$G$5:$G$3576,N$4,'Lista pracowników'!$B$5:$B$3576,$B9)","v":4},null,{"$f":"IFERROR(((SUMIFS('Lista pracowników'!$A$5:$A$3576,'Lista pracowników'!$G$5:$G$3576,P$4,'Lista pracowników'!$B$5:$B$3576,$B9))/SUM($I9:$N9)),\"-\")","v":5.5555555555555552E-2},{"$f":"IFERROR(((SUMIFS('Lista pracowników'!$A$5:$A$3576,'Lista pracowników'!$G$5:$G$3576,Q$4,'Lista pracowników'!$B$5:$B$3576,$B9))/SUM($I9:$N9)),\"-\")","v":0},{"$f":"IFERROR(((SUMIFS('Lista pracowników'!$A$5:$A$3576,'Lista pracowników'!$G$5:$G$3576,R$4,'Lista pracowników'!$B$5:$B$3576,$B9))/(SUM($I9:$N9))),\"-\")","v":0},{"$f":"IFERROR(((SUMIFS('Lista pracowników'!$A$5:$A$3576,'Lista pracowników'!$G$5:$G$3576,S$4,'Lista pracowników'!$B$5:$B$3576,$B9))/SUM($I9:$N9)),\"-\")","v":0.22222222222222221},{"$f":"IFERROR(((SUMIFS('Lista pracowników'!$A$5:$A$3576,'Lista pracowników'!$G$5:$G$3576,T$4,'Lista pracowników'!$B$5:$B$3576,$B9))/SUM($I9:$N9)),\"-\")","v":0.5},{"$f":"IFERROR(((SUMIFS('Lista pracowników'!$A$5:$A$3576,'Lista pracowników'!$G$5:$G$3576,U$4,'Lista pracowników'!$B$5:$B$3576,$B9))/SUM($I9:$N9)),\"-\")","v":0.22222222222222221}]
[5,"Elektryk",null,null,1,{"$f":"IF(E10>'Lista pracowników'!$M$4,\"-\",VLOOKUP($E10,'Siatka płac'!$B$6:$E$17,3,FALSE))","v":2000},{"$f":"IF(E10>'Lista pracowników'!$M$4,\"-\",VLOOKUP($E10,'Siatka płac'!$B$6:$E$17,4,FALSE))","v":4000},{"$f":"SUMIFS('Lista pracowników'!$A$5:$A$8386,'Lista pracowników'!$B$5:$B$8386,$B10)","v":7},{"$f":"SUMIFS('Lista pracowników'!$A$5:$A$3576,'Lista pracowników'!$G$5:$G$3576,I$4,'Lista pracowników'!$B$5:$B$3576,$B10)","v":0},{"$f":"SUMIFS('Lista pracowników'!$A$5:$A$3576,'Lista pracowników'!$G$5:$G$3576,J$4,'Lista pracowników'!$B$5:$B$3576,$B10)","v":0},{"$f":"SUMIFS('Lista pracowników'!$A$5:$A$3576,'Lista pracowników'!$G$5:$G$3576,K$4,'Lista pracowników'!$B$5:$B$3576,$B10)","v":0},{"$f":"SUMIFS('Lista pracowników'!$A$5:$A$3576,'Lista pracowników'!$G$5:$G$3576,L$4,'Lista pracowników'!$B$5:$B$3576,$B10)","v":1},{"$f":"SUMIFS('Lista pracowników'!$A$5:$A$3576,'Lista pracowników'!$G$5:$G$3576,M$4,'Lista pracowników'!$B$5:$B$3576,$B10)","v":2},{"$f":"SUMIFS('Lista pracowników'!$A$5:$A$3576,'Lista pracowników'!$G$5:$G$3576,N$4,'Lista pracowników'!$B$5:$B$3576,$B10)","v":4},null,{"$f":"IFERROR(((SUMIFS('Lista pracowników'!$A$5:$A$3576,'Lista pracowników'!$G$5:$G$3576,P$4,'Lista pracowników'!$B$5:$B$3576,$B10))/SUM($I10:$N10)),\"-\")","v":0},{"$f":"IFERROR(((SUMIFS('Lista pracowników'!$A$5:$A$3576,'Lista pracowników'!$G$5:$G$3576,Q$4,'Lista pracowników'!$B$5:$B$3576,$B10))/SUM($I10:$N10)),\"-\")","v":0},{"$f":"IFERROR(((SUMIFS('Lista pracowników'!$A$5:$A$3576,'Lista pracowników'!$G$5:$G$3576,R$4,'Lista pracowników'!$B$5:$B$3576,$B10))/(SUM($I10:$N10))),\"-\")","v":0},{"$f":"IFERROR(((SUMIFS('Lista pracowników'!$A$5:$A$3576,'Lista pracowników'!$G$5:$G$3576,S$4,'Lista pracowników'!$B$5:$B$3576,$B10))/SUM($I10:$N10)),\"-\")","v":0.14285714285714285},{"$f":"IFERROR(((SUMIFS('Lista pracowników'!$A$5:$A$3576,'Lista pracowników'!$G$5:$G$3576,T$4,'Lista pracowników'!$B$5:$B$3576,$B10))/SUM($I10:$N10)),\"-\")","v":0.2857142857142857},{"$f":"IFERROR(((SUMIFS('Lista pracowników'!$A$5:$A$3576,'Lista pracowników'!$G$5:$G$3576,U$4,'Lista pracowników'!$B$5:$B$3576,$B10))/SUM($I10:$N10)),\"-\")","v":0.5714285714285714}]
{"$rows_left_out":56}
{"sheet":"Zestawienie objaśnienia","index":4,"n_rows":23,"n_cols":21,"rows_kept":23,"cut":false,"hidden":false,"merged":[[2,15,2,20],[0,9,1,20],[0,1,0,3],[0,5,0,6],[1,5,2,6],[1,7,2,7],[2,8,2,13],[19,3,22,3],[11,2,13,3],[11,5,11,7],[15,3,18,7],[11,9,12,20],[13,9,15,20]]}
[null,"Zestawienie stanowisk",null,null,null,"Od którego miesiąca wprowadza się siatkę:",null,12,null,"Koszt jednorazowego podniesienia wynagrodzenia pracownikom, którzy są poniżej wynagrodzenia minimalnego w swojej kategorii.\nKoszt \"roczny\" zależy do miesiąca wdrożenia siatki. Np. jeśli to lipiec to koszt podniesienia wynagrodzeń do minimium mnożony jest przez 6"]
[null,null,null,null,null,"Koszt wdrożenia siatki płac do końca roku bieżącego:",null,{"$f":"SUM('Lista pracowników'!$H$5:$H$650)","v":700}]
[null,"Menu","Siatka płac","Zestawienie stanowisk",null,null,null,null,"Liczebności pracowników w kwartylach ",null,null,null,null,null,null,"% liczeność pracowników w kwartylach "]
[null,"tekst",{"$f":"MAX('Siatka płac'!B6:B17)","v":7},null,null,null,null,null,"poniżej min.","I","II","III","IV","powyżej maks.",null,"poniżej min.","I","II","III","IV","powyżej maks."]
["Lp","Stanowisko","Pion","Poziom stanowiska","Kategoria zaszeregowania","Minimum\nkategorii w\nsiatce płac","Maksimum\nkategorii w\nsiatce płac","Liczba pracowników na stanowisku",2,89,81,104,65,83,null,4.7169811320754715E-3,0.2099056603773585,0.19103773584905662,0.24528301886792453,0.15330188679245282,0.19575471698113209]
[1,"Monter",null,null,1,2000,4000,158,1,59,31,67,0,0,null,6.3291139240506328E-3,0.37341772151898733,0.19620253164556961,0.42405063291139239,0,0]
[2,"Operator",null,null,8,2000,4000,50,0,30,13,6,1,0,null,0,0.6,0.26,0.12,0.02,0]
[]
[]
[]
{"$rows_left_out":14}
{"sheet":"Siatka płac","index":5,"n_rows":22,"n_cols":5,"rows_kept":22,"cut":false,"hidden":false,"merged":[[0,1,0,4]]}
[null,"Siatka płac"]
[]
[null,"Zestawienie stanowisk",null,"Lista pracowników","Menu"]
[]
[null,"Kategoria zaszeregowania","Rozpiętość kategorii","Minimum\nkategorii","Maximum\nkategorii"]
[null,{"$f":"IF(NOT(OR(ISBLANK(C6),ISBLANK(D6))),1,0)","v":1},2000,2000,{"$f":"D6+C6","v":4000}]
[null,{"$f":"IF(NOT(AND(ISBLANK(C7),ISBLANK(D7))),1+B6,0)","v":2},2200,2500,{"$f":"D7+C7","v":4700}]
[null,3,2500,3000,5500]
[null,4,2800,3200,6000]
[null,5,3000,3500,6500]
{"$rows_left_out":12}